program: Gaussian 09
title: 000036386
version: EM64L-G09RevD.01
frameworkgroup: C1[X(C13H18N2O)]
method: RPBEPBE
basis: SDD
operation: Freq
keyword: #p
keyword: freq=noraman
keyword: PBEPBE/SDD
title: #p freq=noraman PBEPBE/SDD
converged: YES YES NO NO
title: Mulliken charges:
elementType: O N N C C C C C C C C C C C C C H H H H H H H H H H H H H H H H H H
charge: -0.304170 -0.435612 -0.117981 -0.173225 0.193054 -0.369061 0.368195 -0.485718 -0.216576 -0.387324 -0.425801 -0.388930 -0.218737 -0.226852 -0.679797 -0.246209 0.227822 0.219532 0.225036 0.227989 0.227586 0.313981 0.198413 0.188903 0.206724 0.215179 0.277840 0.266475 0.222951 0.224389 0.210028 0.224565 0.211867 0.225461
chargesum: 0.00000
title: Mulliken charges with hydrogens summed into heavy atoms:
elementType: O N N C C C C C C C C C C C C C
charge: -0.304170 -0.121631 -0.117981 0.054597 0.193054 0.075508 0.368195 -0.030143 0.170741 0.034580 -0.147961 -0.122456 0.004214 -0.002463 -0.033337 -0.020747
polarizability: 1.79641177e+02 4.52502379e+00 1.59788421e+02 1.01002706e+00 -1.84517443e+01 1.16231421e+02
1716.lowfreq: -11.5314 -9.9667 -3.1969 -0.0011 -0.0010 -0.0008 26.0108 33.7799 37.5681
frequency: 25.3693 33.6749 37.3138 47.7474 51.8841 72.7537 79.7942 115.6010 183.1409 199.6149 210.2361 222.6593 270.4149 281.2224 316.1416 403.3531 405.3423 418.3119 470.6591 521.0916 607.6573 616.4627 670.6069 699.7590 719.6238 731.7731 762.2310 779.7593 821.7290 848.6807 865.5702 886.0876 890.8483 905.0715 919.7681 938.5112 949.1652 981.5492 989.1133 990.9704 999.6176 1026.9467 1038.0348 1044.3615 1054.6006 1077.2591 1082.8588 1133.4454 1145.4597 1165.2087 1170.2828 1183.3926 1193.4814 1211.7170 1227.6099 1232.3218 1261.3205 1275.0967 1277.4453 1281.5621 1302.3411 1311.6557 1322.8578 1381.7830 1385.9158 1395.3784 1435.4149 1451.5020 1469.5213 1472.9859 1479.0215 1480.2684 1481.4677 1490.8201 1507.0994 1590.2469 1593.0531 1614.4707 2932.6709 2964.7332 2973.7574 2978.2266 2984.1620 2997.2398 3006.8422 3019.1037 3047.4842 3059.8927 3077.6539 3081.5335 3119.5787 3127.7326 3140.4200 3157.0760 3175.1926 3613.4989
redmass: 2.2092 3.5941 3.4080 2.2559 2.7664 3.3696 3.9971 2.7580 3.8253 3.6939 2.0520 1.6203 4.8127 3.9405 4.5720 2.2374 2.7271 1.5213 3.3837 4.8588 5.7784 6.4490 5.7112 3.7430 1.6599 4.4560 1.0841 2.5416 1.2332 3.3895 1.2440 1.4843 2.2593 2.0468 4.2918 1.9885 2.8711 3.9578 3.7385 1.6027 1.3090 2.4166 5.2114 3.3996 2.7689 1.6208 1.6106 2.2392 1.4691 1.1349 1.0605 1.2632 1.7449 1.0916 1.2669 1.6273 1.4733 1.3571 1.2016 1.2355 1.4862 1.4107 1.3008 2.7866 2.0393 1.2768 2.2180 2.2748 1.1077 1.0711 1.0423 1.2798 1.6937 1.0861 1.1744 6.8123 6.3499 6.0414 1.0554 1.0829 1.0574 1.0359 1.1057 1.0601 1.0613 1.1068 1.1017 1.1069 1.1021 1.0991 1.0848 1.0887 1.0941 1.0988 1.0956 1.0801
irintensity: 4.9856 0.2378 1.5645 2.7827 0.6417 0.2128 0.8028 0.9900 8.3267 4.0041 8.3988 6.4848 4.8215 19.6164 2.4536 26.9601 5.8477 95.4344 5.0199 0.9311 4.0462 0.0686 3.9865 0.4087 109.2527 19.8038 2.2594 5.6631 1.7776 1.1570 0.1340 4.3449 8.1878 11.2503 17.2919 1.0196 12.2966 14.0539 0.0354 0.3732 1.6693 51.2733 145.4380 16.7038 8.4132 0.0653 7.0529 1.2846 0.9343 1.5203 1.1682 12.8795 9.9608 0.2909 1.0304 17.9015 23.5868 35.0586 13.1085 19.5213 0.6512 4.8492 5.7842 1.6802 1.7043 14.4006 14.5369 69.8509 1.9513 6.2639 12.1598 10.5031 15.6323 14.4880 16.6495 85.9480 0.6250 7.8528 44.6209 25.0219 69.3435 40.5296 32.2609 26.7784 78.3034 19.4191 3.5376 48.5750 81.7157 42.5813 0.1295 5.4995 24.0696 35.0874 9.3239 32.2786
temp: 298.150 k
press: 1.00000 atm
elementType: 8 7 7 6 6 6 6 6 6 6 6 6 6 6 6 6 1 1 1 1 1 1 1 1 1 1 1 1 1 1 1 1 1 1
symmnumber: 1
zpe: 751529.3 jmol-1
zpe.correction: 0.286242 hartree
zpe.thermalcorrener: 0.302603 hartree
zpe.thermalcorrenthalpy: 0.303547 hartree
zpe.thermalcorrgfe: 0.239163 hartree
zpe.sumelectzpe: -689.675715 hartree
zpe.sumelectthermal: -689.659355 hartree
zpe.sumelectthermalent: -689.658411 hartree
zpe.sumelectthermalfe: -689.722795 hartree
dipole: 1.8248 0.3532 2.1498
dipole: 2.8419
quadrupole: -86.3495 -90.6037 -97.4623
quadrupole: -0.2652 0.3131 4.4573
quadrupole: 5.1223 0.8682 -5.9905 -0.2652 0.3131 4.4573
hfenergy: -689.9619576 hartree
pointgroup: C01 [X(C13H18N2O1)]
dipole: -0.5711156 -0.1281625 0.9526347 debye
polarizability: 179.6820762|4.3362757|152.3446803|-7.7211624|23.453579|123.6342628 unknown
InChI: InChI=1S/C13H18N2O/c1-2-10-16-12(13-14-8-9-15-13)11-6-4-3-5-7-11/h3-7,12,14H,2,8-10H2,1H3
charge 0 multiplicity 1
34 atoms
O  -0.923447 1.141612 0.204126
N  -0.955355 -1.647959 0.845731
N  -1.058348 -2.113536 -1.407287
C  -0.326209 0.195918 -0.749285
C  -0.807655 -1.221239 -0.468138
C  -1.37389 -3.065734 0.869469
C  1.200359 0.303306 -0.651118
C  -1.414417 -3.387788 -0.678443
C  -2.361408 1.366981 -0.036035
C  -2.849044 2.390239 0.993868
C  1.815955 1.287593 0.157051
C  2.005466 -0.583621 -1.409627
C  3.226554 1.380563 0.209079
C  3.4128 -0.485459 -1.358251
C  -4.350665 2.708354 0.820748
C  4.029404 0.497162 -0.547601
H  -0.646364 0.440412 -1.784548
H  -2.362778 -3.192132 1.35103
H  -0.641736 -3.696506 1.408147
H  -0.688436 -4.175115 -0.95062
H  -2.413664 -3.727135 -1.005024
H  -0.813785 -1.048573 1.655652
H  -2.916951 0.409259 0.062691
H  -2.508189 1.746125 -1.071211
H  -2.656975 1.994755 2.009509
H  -2.247706 3.312956 0.890075
H  1.18471 1.970169 0.73219
H  1.522955 -1.349837 -2.028357
H  3.696785 2.144952 0.838577
H  4.02762 -1.17369 -1.949517
H  -4.971436 1.800757 0.942094
H  -4.685052 3.447393 1.570289
H  -4.559197 3.127732 -0.181383
H  5.122098 0.572786 -0.50798
