program: Gaussian 09
title: 000036458
version: EM64L-G09RevD.01
frameworkgroup: C1[X(C9H20N4O4)]
method: RPBEPBE
basis: SDD
operation: Freq
keyword: #p
keyword: freq=noraman
keyword: PBEPBE/SDD
title: #p freq=noraman PBEPBE/SDD
converged: YES YES NO NO
title: Mulliken charges:
elementType: O O O O N N N N C C C C C C C C C H H H H H H H H H H H H H H H H H H H H
charge: -0.516674 -0.242487 -0.430968 -0.289036 -0.565671 -0.389052 -0.025300 -0.723208 -0.128591 -0.461326 -0.048228 -0.537565 -0.460361 0.255669 -0.418268 -0.600557 0.222835 0.259673 0.225099 0.231783 0.217585 0.261613 0.196608 0.302473 0.233408 0.275260 0.256233 0.282065 0.409060 0.379073 0.304491 0.231854 0.213606 0.234754 0.254649 0.190801 0.398698
chargesum: 0.00000
title: Mulliken charges with hydrogens summed into heavy atoms:
elementType: O O O O N N N N C C C C C C C C C
charge: -0.107614 -0.242487 -0.032270 -0.289036 -0.034178 -0.106987 -0.025300 -0.039644 0.131083 -0.004444 0.169357 -0.079344 0.075521 0.255669 0.027192 0.079647 0.222835
polarizability: 1.59530162e+02 -6.59618443e+00 1.34313866e+02 -3.69126194e+00 -8.28810955e+00 1.24280815e+02
1716.lowfreq: -17.6427 -14.8481 -8.6484 0.0004 0.0008 0.0009 39.7973 53.7180 73.4850
frequency: 38.5127 53.6987 73.3041 80.0756 114.1920 125.8121 131.9446 137.0948 142.0178 155.4492 171.6512 179.8157 201.8535 233.6572 251.4448 257.8117 324.6482 343.1201 349.0569 386.1487 392.6249 408.1126 426.0267 441.7931 464.9387 484.2224 495.9827 555.2026 581.4059 594.7307 602.8649 630.7800 700.0674 731.6971 782.3376 837.5311 847.9133 868.2900 886.8802 913.5130 926.5636 940.6340 961.6828 973.9473 974.7294 1027.5230 1040.5332 1047.4056 1079.1246 1097.2000 1108.1379 1109.9847 1128.8005 1141.3592 1164.1516 1190.2701 1213.5908 1218.5584 1236.9061 1254.7259 1259.7248 1276.0125 1284.4914 1306.4041 1313.3494 1320.5122 1323.7423 1349.1935 1361.4982 1374.1632 1390.2728 1398.4827 1421.9732 1445.0839 1452.8837 1461.3406 1469.5466 1473.2365 1473.5292 1489.1519 1544.7620 1587.3272 1624.8081 1638.6808 1639.3127 1952.3693 2314.6643 2888.8781 2915.1144 2979.6205 2983.7483 2994.6867 3021.3692 3029.1076 3048.8834 3063.1343 3073.7155 3081.4251 3092.2987 3111.0921 3368.7052 3378.4910 3450.0541 3562.7526 3579.1482
redmass: 4.8997 5.8516 3.8495 3.2105 4.4804 4.0547 3.8703 3.1943 2.9773 3.5700 2.4591 2.1302 1.4204 2.4716 3.9170 3.0926 3.3135 3.1210 2.8317 2.8380 2.3668 2.6798 2.9491 1.9544 2.2888 2.1295 2.5600 1.6011 1.6414 3.8233 4.0138 3.2779 6.7543 5.9640 2.8302 2.4493 2.3707 2.4870 4.8526 1.9567 4.4448 2.0257 2.4413 2.3381 1.9479 2.1605 2.3040 2.2372 1.7423 1.6399 1.7738 1.6037 1.5879 1.7760 1.5250 1.4911 1.7936 2.5759 1.8091 1.4605 1.2513 1.6658 1.3213 1.3005 1.3389 1.2502 1.2071 1.3771 1.3178 1.2298 1.2938 1.3373 1.1617 1.1191 1.1085 1.0867 1.0829 1.0653 1.0735 1.4522 1.3673 1.7418 5.6131 1.4572 1.1071 1.1247 1.0541 1.0548 1.0684 1.0662 1.0843 1.0657 1.0621 1.0814 1.0770 1.0989 1.0908 1.0963 1.1073 1.1013 1.0761 1.0551 1.0449 1.0900 1.0974
irintensity: 0.4017 8.1970 1.1507 4.0054 2.5349 2.6435 3.7560 12.5644 0.5793 5.8136 4.7741 24.5693 11.3957 26.1038 79.5826 10.5771 26.0588 5.7794 13.1713 37.7081 26.9661 14.5313 0.6129 15.9676 15.4996 20.6998 38.5725 93.2767 252.5176 15.4700 20.4671 20.7311 0.1951 6.9981 3.8548 18.8276 10.2003 7.3384 5.4914 158.5048 1.5626 22.8661 16.6374 16.3475 11.5958 37.9913 17.7478 28.9810 17.1925 21.4758 57.2492 36.6658 63.6571 31.9861 30.9035 31.8378 31.8207 18.7121 10.6110 38.2634 25.0335 116.5502 44.1557 69.1403 6.7279 57.1668 167.7895 33.6391 85.0074 5.2940 105.0265 122.1109 2.3444 29.1755 18.2024 33.1043 15.5111 15.2083 7.6051 42.7014 91.8325 266.3874 201.5498 41.2807 46.9227 1489.8976 464.5288 102.9885 95.4818 23.6680 33.4507 34.3650 11.6419 24.4901 24.3519 10.6907 11.8110 10.0351 14.0932 18.1450 28.6561 122.4756 0.5734 34.8383 0.9243
temp: 298.150 k
press: 1.00000 atm
elementType: 8 8 8 8 7 7 7 7 6 6 6 6 6 6 6 6 6 1 1 1 1 1 1 1 1 1 1 1 1 1 1 1 1 1 1 1 1
symmnumber: 1
zpe: 806299.8 jmol-1
zpe.correction: 0.307103 hartree
zpe.thermalcorrener: 0.325930 hartree
zpe.thermalcorrenthalpy: 0.326874 hartree
zpe.thermalcorrgfe: 0.260872 hartree
zpe.sumelectzpe: -873.450281 hartree
zpe.sumelectthermal: -873.431455 hartree
zpe.sumelectthermalent: -873.430511 hartree
zpe.sumelectthermalfe: -873.496513 hartree
dipole: -0.8499 0.9921 -1.6900
dipole: 2.1361
quadrupole: -81.2647 -106.8990 -108.4357
quadrupole: 4.9897 -9.8284 -14.5687
quadrupole: 17.6018 -8.0325 -9.5692 4.9897 -9.8284 -14.5687
hfenergy: -873.7573846 hartree
pointgroup: C01 [X(C9H20N4O4)]
dipole: 0.1430922 -0.3547886 -0.7482658 debye
polarizability: 155.9540142|-10.7449496|136.0255695|-0.1460452|10.4708346|126.1452599 unknown
InChI: InChI=1S/C9H20N4O4/c1-13(5-9(16)17)12-8(15)3-6(11)2-7(14)4-10/h6-7,12,14,16H,2-5,10-11H2,1H3
charge 0 multiplicity 1
37 atoms
O  2.22724 1.704825 -1.152096
O  -0.521837 -1.469287 1.579962
O  -0.272914 1.880051 -1.373889
O  -0.345309 2.438618 0.882515
N  2.258428 -3.172139 -1.265337
N  -1.77664 -0.778874 -0.280103
N  -2.503497 0.223676 0.409152
N  2.470554 1.940908 1.26903
C  1.473207 -2.0911 -0.634266
C  1.598769 -0.681259 -1.313064
C  2.512107 0.344101 -0.612603
C  -0.032946 -2.503874 -0.582125
C  2.304599 0.48662 0.950544
C  -0.800308 -1.555878 0.350276
C  -2.363291 1.564459 -0.218875
C  -3.897009 -0.176679 0.706888
C  -0.898282 2.020931 -0.175641
H  1.802408 -2.038861 0.41979
H  1.947497 -0.815454 -2.355401
H  0.596996 -0.224046 -1.381302
H  3.578317 0.130882 -0.826224
H  -0.087763 -3.525412 -0.169025
H  -0.455927 -2.51996 -1.607388
H  1.295092 0.154544 1.245593
H  3.03704 -0.128965 1.499926
H  3.252528 -3.174736 -1.019308
H  2.116468 -3.255504 -2.277885
H  -1.949908 -0.917155 -1.288093
H  2.466995 2.254952 -0.245432
H  1.57538 2.365136 1.563455
H  3.251744 2.163822 1.891867
H  -2.967905 2.264343 0.382389
H  -2.721444 1.587309 -1.274265
H  -4.346691 0.579771 1.372721
H  -3.880086 -1.13998 1.240522
H  -4.537333 -0.277439 -0.202628
H  0.827021 1.906353 -1.328579
