program: Gaussian 09
title: 000000990
version: EM64L-G09RevD.01
frameworkgroup: C1[X(C10H15N5O13P2S)]
method: RPBEPBE
basis: SDD
operation: Freq
keyword: #p
keyword: freq=noraman
keyword: PBEPBE/SDD
title: #p freq=noraman PBEPBE/SDD
converged: YES YES NO NO
title: Mulliken charges:
elementType: S P P O O O O O O O O O O O O O N N N N N C C C C C C C C C C H H H H H H H H H H H H H H H
charge: 1.258002 1.383231 1.473631 -0.286673 -0.499884 -0.556670 -0.485482 -0.692162 -0.706865 -0.574113 -0.712340 -0.635729 -0.662171 -0.532711 -0.369435 -0.383486 -0.198876 -0.077066 -0.255554 -0.055403 -0.598650 -0.165906 -0.081601 -0.059237 -0.059921 -0.342784 0.287946 -0.187358 -0.096704 0.178683 -0.301576 0.285796 0.265206 0.277733 0.265376 0.240971 0.263491 0.438580 0.293595 0.438803 0.432012 0.261130 0.344810 0.353970 0.405984 0.429407
chargesum: 0.00000
title: Mulliken charges with hydrogens summed into heavy atoms:
elementType: S P P O O O O O O O O O O O O O N N N N N C C C C C C C C C C
charge: 1.258002 1.383231 1.473631 -0.286673 -0.499884 -0.118090 -0.485482 -0.253360 -0.274854 -0.574113 -0.712340 -0.229745 -0.662171 -0.103304 -0.369435 -0.383486 -0.198876 -0.077066 -0.255554 -0.055403 0.100130 0.119891 0.183605 0.218497 0.205454 0.161678 0.287946 0.106237 -0.096704 0.178683 -0.040446
polarizability: 3.88255156e+02 -2.18414736e+01 2.79354619e+02 5.53946508e+00 8.11437039e+00 1.88505718e+02
1716.lowfreq: -3.0270 -1.7834 0.0010 0.0014 0.0020 5.6453 13.4211 22.4669 32.6193
frequency: 13.0613 22.3650 32.5949 36.2531 39.9322 55.6757 57.3140 73.7134 79.5505 89.4914 90.4496 100.4894 121.0020 125.9270 133.8398 151.0220 164.7047 169.5337 185.1752 193.2474 205.3185 218.1201 224.2122 229.5546 247.9817 249.7099 274.0394 281.1628 282.1763 298.0441 301.2315 312.4111 318.1141 334.9141 347.6278 352.0089 353.9028 362.6553 381.0772 393.1229 403.0882 409.1394 428.6281 453.9967 477.1806 512.9839 532.1583 534.2777 547.1976 548.4701 564.5661 567.3935 574.4657 600.1713 617.8305 641.3664 642.1219 662.4583 665.5676 715.0571 717.0472 726.8275 761.0197 784.5844 790.8514 795.5329 807.7925 839.6985 870.0190 877.8015 898.9708 903.2885 930.3501 946.2909 953.7352 962.9741 981.0985 1002.3593 1011.7749 1021.1643 1022.5423 1031.6291 1047.7865 1054.3638 1061.0803 1074.3709 1103.1211 1112.0807 1114.4830 1140.4665 1148.4890 1182.1441 1196.6861 1222.5679 1223.3457 1231.0899 1246.7171 1256.1910 1276.1482 1281.4614 1300.0986 1326.0065 1328.6714 1338.9118 1347.7551 1361.9530 1371.9201 1378.3154 1388.6269 1391.0798 1433.9916 1460.6288 1480.5944 1522.3579 1548.0692 1585.2016 1642.5489 2350.6452 2663.9345 2981.3704 2988.0837 3001.0177 3022.4543 3046.9477 3051.7125 3113.6249 3179.7124 3260.7723 3403.3814 3532.2848 3578.7370 3685.2385
redmass: 9.4382 9.3063 9.1110 10.3922 9.8224 9.5316 7.8039 12.5064 8.2694 7.9910 11.2959 7.3379 9.0207 8.5404 6.7831 8.1039 7.0545 6.7743 6.6505 5.0010 6.7226 6.5256 5.3993 5.5086 4.8204 4.1630 5.0267 3.6702 2.9204 7.3983 6.2334 8.5569 5.7083 7.2040 1.8547 6.2502 7.9773 4.2759 6.7475 7.5187 10.5655 3.7096 8.2289 7.1802 8.1217 3.6599 8.0504 4.8962 4.5681 5.7644 1.1342 1.3582 3.6717 6.1859 8.2976 8.1476 4.6453 8.4414 8.4952 7.9709 7.8434 6.1791 11.1414 2.0420 7.4230 5.6512 3.2372 1.5031 12.4610 8.5843 2.0309 4.2681 1.4217 9.2150 1.1094 2.4583 7.9275 6.1078 3.0574 6.8628 14.8597 1.6720 5.0222 4.3642 3.7919 1.3577 2.8326 2.8278 1.1850 2.5899 3.7676 1.7623 1.2537 2.0985 1.2138 1.3506 1.3111 1.5620 1.4343 1.9680 3.1734 1.5011 1.1793 1.8324 1.5086 1.3620 1.3282 1.9733 1.7975 4.0625 3.1361 1.0856 3.9151 1.4543 4.5476 1.7344 2.8974 1.0772 1.0746 1.0837 1.0845 1.0858 1.0627 1.0841 1.0702 1.1059 1.0933 1.0993 1.0648 1.0448 1.0664 1.1056
irintensity: 1.0058 1.8723 1.3060 4.4892 0.6188 0.2282 0.9146 1.3285 5.6723 3.1549 1.4139 5.2624 1.5570 9.5061 1.2263 2.1248 14.4789 1.0432 13.7317 7.9111 6.2565 11.2656 18.9641 1.4487 38.9511 21.1127 6.6901 19.2211 37.2409 0.3543 4.9561 17.5774 28.1819 44.4742 107.2702 28.7984 95.2297 46.3163 6.5102 36.8586 66.8674 15.6306 25.5285 4.6396 15.1099 20.9798 1.9542 23.5672 115.6929 92.7457 31.2778 176.2595 15.4954 19.2204 7.4008 1.8226 67.1261 16.0512 33.6793 40.7373 50.9585 272.4542 355.5555 228.3027 10.5925 39.5838 220.4428 13.4120 56.7408 3.0461 8.4303 21.8036 15.1317 167.0151 132.1240 16.8802 377.3866 6.8424 16.5707 36.4056 44.6303 100.8012 244.2054 61.3704 16.3954 79.6776 21.2738 220.9487 126.3115 13.1657 27.5461 58.2123 2.0960 11.4922 147.8148 22.3241 30.7543 32.2077 105.9691 105.0902 12.0785 91.2918 74.2806 10.3035 124.7938 63.2444 9.6187 30.5789 16.5940 24.4782 26.7533 12.6048 21.8765 676.3480 53.0540 16.2010 642.2735 3621.3029 936.6194 1.4238 7.9902 26.1712 13.7642 16.4293 433.6760 4.8318 4.9677 4.7559 104.8817 173.4445 137.0830 57.7903
temp: 298.150 k
press: 1.00000 atm
elementType: 16 15 15 8 8 8 8 8 8 8 8 8 8 8 8 8 7 7 7 7 7 6 6 6 6 6 6 6 6 6 6 1 1 1 1 1 1 1 1 1 1 1 1 1 1 1
symmnumber: 1
zpe: 781624.7 jmol-1
zpe.correction: 0.297705 hartree
zpe.thermalcorrener: 0.329662 hartree
zpe.thermalcorrenthalpy: 0.330606 hartree
zpe.thermalcorrgfe: 0.232637 hartree
zpe.sumelectzpe: -2719.678803 hartree
zpe.sumelectthermal: -2719.646846 hartree
zpe.sumelectthermalent: -2719.645901 hartree
zpe.sumelectthermalfe: -2719.743871 hartree
dipole: 6.4393 9.2436 -0.8423
dipole: 11.2968
quadrupole: -153.3419 -221.0490 -205.9193
quadrupole: -23.7384 13.1139 -3.8078
quadrupole: 40.0948 -27.6123 -12.4825 -23.7384 13.1139 -3.8078
hfenergy: -2719.9765079 hartree
pointgroup: C01 [X(C10H15N5O13P2S1)]
dipole: 2.4242068 -3.7077795 0.3596473 debye
polarizability: 389.4787561|18.5482434|278.2521524|-4.7230698|7.8495046|188.3845842 unknown
InChI: InChI=1S/C10H15N5O13P2S/c11-8-5-9(13-2-12-8)15(3-14-5)10-6(16)7(27-29(17,18)19)4(26-10)1-25-30(20,21)28-31(22,23)24/h2-4,6-7,10,16-18,20,22H,1,11H2
charge 0 multiplicity 1
46 atoms
S  -5.404766 1.126516 -1.28505
P  -1.90689 2.464571 0.376286
P  -4.115834 -1.294151 0.719291
O  0.759462 -1.992442 -0.049047
O  -1.460865 0.886542 -0.369197
O  1.307616 1.435752 1.185474
O  -2.972212 -2.051364 -0.291471
O  -0.918506 2.51647 1.752082
O  -3.443727 2.133594 1.009746
O  -1.87416 3.638133 -0.675997
O  -5.246698 -0.648307 -0.378004
O  -4.971507 -2.666408 1.286642
O  -3.558318 -0.349469 1.87932
O  -6.426086 0.205814 -2.464722
O  -4.050868 1.599506 -1.975838
O  -6.335259 2.05866 -0.395284
N  2.963074 -1.040608 -0.045659
N  4.868566 -1.882835 -1.0070
N  3.790862 1.243349 0.529671
N  6.1184 1.58034 -0.132379
N  7.402083 -0.0855 -1.200104
C  -0.566068 0.004178 0.364866
C  0.924201 0.394264 0.256151
C  -0.594917 -1.385453 -0.313732
C  1.615249 -0.960175 0.549159
C  -1.617105 -2.390974 0.231495
C  3.915851 -0.02218 0.015778
C  3.59313 -2.139181 -0.662854
C  5.083998 -0.558854 -0.581424
C  6.219394 0.303348 -0.647491
C  4.941507 1.979191 0.415112
H  -0.849888 -0.060984 1.435375
H  1.133049 0.694525 -0.792465
H  -0.728083 -1.262035 -1.403649
H  1.692813 -1.125137 1.642939
H  -1.60755 -2.415706 1.336701
H  -1.409799 -3.396934 -0.165507
H  2.350571 1.594214 1.037463
H  3.060091 -3.068238 -0.843159
H  0.079297 2.238464 1.608369
H  -3.48887 1.291397 1.583186
H  4.906987 2.999261 0.806037
H  8.178682 0.573522 -1.222592
H  7.499139 -1.021229 -1.590717
H  -5.680559 -2.473133 1.953839
H  -6.381686 -0.744913 -2.13454
