program: Gaussian 09
title: 000036426
version: EM64L-G09RevD.01
frameworkgroup: C1[X(C18H26O5)]
method: RPBEPBE
basis: SDD
operation: Freq
keyword: #pfreq=noraman
keyword: PBEPBE/SDD
title: #p freq=noraman PBEPBE/SDD
converged: YES YES NO NO
title: Mulliken charges:
elementType: O O O O O C C C C C C C C C C C C C C C C C C H H H H H H H H H H H H H H H H H H H H H H H H H H
charge: -0.271704 -0.267338 -0.267966 -0.242526 -0.246150 -0.370331 -0.348154 -0.245967 -0.374331 -0.352267 -0.258990 -0.236729 -0.688548 -0.272878 0.191297 0.170536 -0.689235 0.175896 0.157673 -0.345182 -0.373931 -0.222240 -0.221207 0.206445 0.203939 0.192343 0.193895 0.179812 0.185425 0.204287 0.204620 0.206672 0.198726 0.254202 0.218616 0.183891 0.202574 0.214977 0.218062 0.211060 0.250894 0.230471 0.206850 0.217934 0.212866 0.260371 0.268138 0.235838 0.237366
chargesum: 0.00000
title: Mulliken charges with hydrogens summed into heavy atoms:
elementType: O O O O O C C C C C C C C C C C C C C C C C C
charge: -0.271704 -0.267338 -0.267966 -0.242526 -0.246150 0.040053 0.038084 0.119270 0.034576 0.053131 0.213829 0.149736 -0.044449 0.208488 0.191297 0.170536 -0.051585 0.175896 0.157673 -0.084811 -0.105794 0.013598 0.016159
polarizability: 2.71410006e+02 -5.63997181e+00 2.20927617e+02 -2.07365430e+01 -1.78629542e+01 1.54873152e+02
1716.lowfreq: -3.1175 -0.0009 -0.0004 0.0002 5.2834 6.9643 13.6152 22.3785 32.1524
frequency: 13.4758 22.2876 32.0626 39.2687 43.3353 49.3804 62.2421 63.8773 77.9280 82.0298 97.5870 114.1014 118.4613 120.9275 130.5336 146.6399 158.7463 187.0828 207.3514 212.2015 234.3075 234.7866 245.9043 248.9238 259.2653 299.7447 326.4800 369.9616 387.8700 398.8487 412.1094 428.3046 430.1812 508.0555 529.9338 555.5899 642.0676 667.6899 680.0621 706.2551 739.4483 743.7067 763.8926 780.7241 786.0074 801.0764 808.8592 810.5906 831.1270 856.8668 894.1354 901.1422 902.6954 913.4502 933.1193 935.4447 972.4196 992.8822 1001.2330 1011.9028 1027.2817 1034.5496 1040.5773 1042.8215 1065.5153 1081.7338 1083.1981 1090.1253 1108.6505 1116.9835 1125.1201 1128.0000 1149.6620 1150.7103 1175.9787 1204.2567 1212.5025 1214.5864 1228.5949 1248.2622 1254.4398 1269.0328 1271.1070 1274.1357 1275.4034 1278.2720 1282.5220 1287.6496 1339.1440 1346.0518 1351.1231 1365.8408 1376.2847 1381.0325 1388.8998 1391.5828 1412.9682 1432.2094 1454.9168 1459.0782 1467.9022 1470.1147 1472.7832 1474.1903 1475.7073 1477.4289 1478.3406 1481.8959 1484.4565 1490.4769 1492.9992 1580.3150 1602.6762 1619.7015 1625.6683 2904.8698 2922.5482 2953.6694 2966.8180 2970.9791 2973.3325 2974.0709 2978.9073 2985.5010 2988.4296 3002.0464 3009.5525 3013.1731 3017.2375 3042.8215 3049.8897 3068.0013 3070.4482 3074.2781 3075.5820 3077.9315 3086.1332 3136.5981 3150.8334 3164.1791 3174.5390
redmass: 4.0547 5.9124 1.8986 5.0341 3.4990 4.0449 4.6561 3.9274 3.2220 1.8548 3.1197 2.9841 2.0644 2.3121 4.4645 4.3130 3.5077 3.8790 5.9404 5.1787 3.6574 1.1093 2.8470 1.2669 3.5539 4.8918 4.7465 4.8336 4.6875 4.1238 3.5946 3.2881 3.3531 3.2587 4.0444 4.8325 6.3828 5.9929 6.9605 4.1532 1.0711 1.0738 3.7507 3.1889 1.8169 1.1476 1.8655 1.9542 3.3874 4.4189 2.7315 1.6272 1.7342 2.5973 1.1621 1.1540 1.4071 4.1089 1.3536 2.4755 4.0267 4.0394 2.8784 3.9742 3.0338 2.3105 2.2145 3.0237 2.8734 1.8828 2.6281 2.5328 1.4794 1.5134 1.0612 1.1607 1.3417 1.3339 3.1103 2.5654 1.1456 1.2887 1.2828 1.1753 1.2158 1.5007 1.0955 1.0862 1.2969 1.4526 1.4652 1.4821 1.5582 8.8674 1.2181 1.2243 1.5308 2.2616 1.0918 1.0879 1.0746 1.0747 1.0977 1.0901 2.1776 1.0544 1.0676 1.0692 1.0664 1.0894 1.0910 7.2186 6.8519 10.6939 11.3842 1.0553 1.0586 1.1048 1.0585 1.0566 1.0370 1.0388 1.1001 1.0587 1.0596 1.0571 1.1004 1.0997 1.0586 1.1032 1.1039 1.1021 1.1013 1.0995 1.1002 1.1059 1.1072 1.0860 1.0905 1.0951 1.1000
irintensity: 0.0227 0.2973 1.3668 0.4400 0.2948 0.1941 2.3452 0.5936 3.8795 0.3526 0.4305 2.0295 0.9196 1.3824 1.5969 6.1701 0.9116 0.2471 6.9073 4.3038 4.0517 0.1179 0.5721 1.0902 2.8086 2.5199 5.2251 3.1225 1.0423 6.0359 4.5858 0.8317 5.8441 9.8917 2.0810 4.6694 3.3084 4.6893 5.2393 63.2544 9.7265 10.2485 15.7498 23.4803 25.0609 0.3020 1.9262 1.0729 12.1383 8.8208 9.7608 5.9784 13.1311 1.2947 0.4829 0.3014 3.3531 39.3329 1.9293 7.9055 70.6809 49.2348 27.0833 55.9731 325.3142 70.5067 2.8821 116.0374 32.8986 22.1108 5.4766 2.4203 2.5594 3.2972 0.8519 5.0677 2.0521 1.6941 94.5367 365.0194 22.9366 0.5877 33.7251 4.6703 11.6934 21.5150 0.2260 0.0628 14.4371 3.7556 11.6710 12.6661 5.2668 9.6833 4.5330 10.4979 0.4991 9.0862 16.9237 18.8014 3.5161 0.2039 0.3937 4.5173 18.4204 16.9372 10.8674 4.2516 3.9434 18.9379 11.7513 15.9561 63.0125 82.9887 234.3038 49.6031 100.4233 47.3192 33.6228 26.1651 25.6686 25.9420 33.4811 63.6596 26.6345 32.0352 3.8837 4.0030 31.3890 9.7717 25.5998 50.1663 91.6677 62.3937 55.4037 79.6249 11.0213 1.6532 8.1858 10.5846 19.0321
temp: 298.150 k
press: 1.00000 atm
elementType: 8 8 8 8 8 6 6 6 6 6 6 6 6 6 6 6 6 6 6 6 6 6 6 1 1 1 1 1 1 1 1 1 1 1 1 1 1 1 1 1 1 1 1 1 1 1 1 1 1
symmnumber: 1
zpe: 1069906.6 jmol-1
zpe.correction: 0.407506 hartree
zpe.thermalcorrener: 0.433413 hartree
zpe.thermalcorrenthalpy: 0.434357 hartree
zpe.thermalcorrgfe: 0.347468 hartree
zpe.sumelectzpe: -1075.849207 hartree
zpe.sumelectthermal: -1075.823300 hartree
zpe.sumelectthermalent: -1075.822356 hartree
zpe.sumelectthermalfe: -1075.909245 hartree
dipole: -3.0696 0.7925 -3.0245
dipole: 4.3816
quadrupole: -128.4670 -122.8437 -142.7117
quadrupole: 12.4590 -11.7220 2.7051
quadrupole: 2.8738 8.4971 -11.3709 12.4590 -11.7220 2.7051
hfenergy: -1076.2567129 hartree
pointgroup: C01 [X(C18H26O5)]
dipole: 1.2129667 -0.295088 -1.1888171 debye
polarizability: 271.5621111|-4.7890379|220.8417908|20.5031231|18.0419409|154.8068737 unknown
InChI: InChI=1S/C18H26O5/c1-3-5-11-21-13-14-23-18(20)16-10-8-7-9-15(16)17(19)22-12-6-4-2/h7-10H,3-6,11-14H2,1-2H3
charge 0 multiplicity 1
49 atoms
O  1.510732 2.202389 0.14135
O  -0.128389 -1.758633 0.200558
O  -1.420354 1.629024 0.066763
O  -1.064969 -0.493042 1.919382
O  -3.536255 2.328731 0.780938
C  3.765698 1.428067 -0.320409
C  5.102951 1.665425 -1.060005
C  2.72197 2.502953 -0.635034
C  2.1783 -2.521171 0.10155
C  3.560802 -2.601809 0.792105
C  1.169997 -1.7425 0.945294
C  0.449487 3.183507 -0.100103
C  6.159764 0.58899 -0.730985
C  -0.776232 2.802209 0.709868
C  -2.401826 -1.059142 -0.051325
C  -3.222844 0.098062 -0.17482
C  4.59717 -3.37071 -0.05487
C  -1.162002 -1.038722 0.794548
C  -2.783464 1.448541 0.300481
C  -2.834261 -2.280923 -0.620621
C  -4.483489 0.00128 -0.810061
C  -4.083409 -2.364894 -1.273609
C  -4.917063 -1.225819 -1.35521
H  3.352813 0.439223 -0.60054
H  3.938531 1.410053 0.773494
H  5.500308 2.665668 -0.791862
H  4.921901 1.683758 -2.154127
H  3.105637 3.513189 -0.360865
H  2.481647 2.511856 -1.722726
H  1.793075 -3.542984 -0.082249
H  2.27881 -2.032807 -0.887154
H  3.933739 -1.577245 0.993078
H  3.452003 -3.093619 1.780042
H  1.461731 -0.685676 1.088373
H  1.010877 -2.201451 1.939111
H  0.790362 4.19449 0.221827
H  0.194383 3.228215 -1.181183
H  5.794765 -0.420765 -0.998676
H  7.100784 0.765744 -1.283059
H  6.39716 0.583763 0.349518
H  -0.495013 2.497977 1.734004
H  -1.504717 3.631898 0.752996
H  4.744996 -2.884421 -1.037869
H  5.5784 -3.415055 0.451793
H  4.264979 -4.40894 -0.242528
H  -2.191983 -3.162138 -0.532399
H  -5.10634 0.899105 -0.877037
H  -4.409268 -3.317368 -1.705051
H  -5.892996 -1.291082 -1.847596
