program: Gaussian 09
title: 000036349
version: EM64L-G09RevD.01
frameworkgroup: C1[X(C19H18N2O3)]
method: RPBEPBE
basis: SDD
operation: Freq
keyword: #p
keyword: freq=noraman
keyword: PBEPBE/SDD
title: #p freq=noraman PBEPBE/SDD
converged: YES YES NO NO
title: Mulliken charges:
elementType: O O O N N C C C C C C C C C C C C C C C C C C C H H H H H H H H H H H H H H H H H H
charge: -0.250104 -0.303239 -0.288152 -0.111121 -0.369141 0.153438 -0.024636 0.294554 0.323451 0.213869 -0.484475 -0.390511 -0.373474 -0.383636 -0.398443 -0.233993 -0.234048 -0.239200 -0.237806 -0.243339 -0.245456 0.308128 -0.217759 -0.673825 0.253522 0.269920 0.264700 0.260235 0.264604 0.258305 0.331071 0.232013 0.230915 0.227805 0.228961 0.232235 0.229769 0.226716 0.228300 0.211351 0.229390 0.229106
chargesum: 0.00000
title: Mulliken charges with hydrogens summed into heavy atoms:
elementType: O O O N N C C C C C C C C C C C C C C C C C C C
charge: -0.250104 -0.303239 -0.288152 -0.111121 -0.038070 0.153438 -0.024636 0.294554 0.323451 0.213869 0.038968 -0.125812 -0.113240 -0.119032 -0.140138 -0.001981 -0.003133 -0.011395 -0.008845 -0.011103 -0.015687 0.308128 0.237257 -0.003978
polarizability: 2.96871080e+02 2.23795721e+01 2.87177333e+02 -1.84107131e+01 1.63387587e+01 1.47263139e+02
1716.lowfreq: -9.7934 -7.1109 -3.8573 -3.6638 0.0004 0.0006 0.0008 15.7832 28.2105
frequency: -4.9167 15.6717 28.2059 33.6811 46.7899 51.3672 76.9779 78.8318 93.0880 114.7650 130.6415 142.8536 178.7257 215.1518 239.5245 247.4039 250.9725 287.0080 293.3334 340.7532 348.7847 361.7284 399.8096 402.2896 407.1021 481.1247 492.7622 536.5911 565.0610 580.8871 613.2215 614.9771 643.1208 664.7482 668.9094 696.8134 697.8205 701.2142 704.5007 707.0492 764.9016 773.7940 780.5768 800.8763 827.4916 850.1516 860.6809 887.6472 924.9223 928.2540 936.1047 943.0941 979.1441 986.1259 987.9506 989.1397 995.1962 997.4172 999.9943 1012.8156 1027.6262 1029.4156 1034.7205 1079.2577 1083.3559 1100.7950 1115.8075 1128.3568 1139.4034 1168.1476 1173.5508 1174.9222 1191.3985 1192.9186 1196.2147 1211.0757 1248.2077 1287.2387 1320.4282 1325.2451 1351.1395 1359.1370 1363.4029 1377.5989 1379.4847 1398.3791 1434.9046 1438.4058 1448.7816 1463.0229 1466.5252 1476.1453 1483.5551 1494.5004 1495.1635 1541.7543 1570.9170 1583.5748 1586.0076 1613.9478 1616.6482 1661.0248 2995.0420 3008.2708 3018.7814 3066.3618 3086.6574 3091.8891 3106.7392 3125.7067 3129.7113 3135.5558 3139.5910 3149.7716 3153.9238 3159.5785 3162.7945 3169.7035 3172.0619 3571.1840
redmass: 4.9140 4.8650 2.8001 3.7342 4.5547 5.0146 4.5801 4.0822 4.4617 3.6509 6.6455 4.0624 4.7669 5.1354 4.4632 3.3235 1.3995 4.3378 5.1137 4.6672 3.5326 4.8311 2.9153 5.4288 2.8921 4.1799 3.6216 3.8306 4.6735 1.2029 6.4394 6.4367 6.2193 6.6719 6.2294 1.8432 9.8543 4.4057 4.9711 2.1748 3.4785 2.4464 2.1272 1.0952 3.1219 1.2503 1.2487 4.7239 4.1308 1.5538 1.4543 7.5518 1.3871 1.4345 5.4357 6.1136 6.6769 1.3327 1.3149 3.3511 2.3713 2.3827 2.1258 1.7513 1.7049 4.9213 2.5443 3.6018 1.4591 2.9984 1.0888 1.0570 1.1459 2.0942 1.1441 3.0123 1.1344 1.5099 1.4317 1.3594 1.2921 2.9168 1.4206 6.4332 7.5385 1.2631 2.3302 2.3244 1.0837 1.0405 2.1889 1.1073 1.3782 2.6688 1.3175 8.7098 7.1437 6.1608 6.8415 6.1001 6.1285 9.5144 1.0357 1.0581 1.0605 1.1069 1.1019 1.0985 1.1026 1.0848 1.0850 1.0885 1.0887 1.0932 1.0931 1.0962 1.0959 1.1002 1.1010 1.0777
irintensity: 0.4560 0.0968 1.5194 0.1028 0.1632 3.2928 1.7718 2.6706 0.3030 4.3884 0.7038 4.0042 1.4965 3.8898 0.1243 0.3419 0.8413 4.3807 10.7688 8.4683 1.1202 0.4388 0.2325 1.4994 0.0846 5.9013 2.4226 22.3832 12.3954 151.8044 0.4727 0.5522 8.3926 14.2888 5.0509 84.1190 15.2850 7.0446 9.7840 7.8421 86.0412 67.3131 15.8123 3.3449 12.8245 2.1805 0.5215 20.3536 32.4775 17.2438 5.4641 21.4857 1.9359 1.9595 0.7835 1.4512 34.2275 0.5589 0.4605 7.3881 18.2073 56.7547 2.3598 12.0310 3.4869 157.0780 25.8290 19.1599 4.9924 2.7139 0.5292 0.2247 9.0048 283.5506 9.4572 115.0313 0.0498 59.0372 2.9468 0.2689 12.2277 19.1133 3.4741 0.2566 3.5034 29.6551 14.8387 6.5850 36.5581 11.2621 24.6471 65.9109 159.3820 24.6216 112.4515 30.3179 0.5713 0.9473 2.0872 1.7197 8.5997 305.7615 22.3638 26.6383 23.2098 9.8167 5.9031 32.2396 46.9961 1.2518 0.8511 7.8965 6.7872 38.9849 19.7759 14.2794 14.9920 20.1387 14.5263 34.1652
temp: 298.150 k
press: 1.00000 atm
elementType: 8 8 8 7 7 6 6 6 6 6 6 6 6 6 6 6 6 6 6 6 6 6 6 6 1 1 1 1 1 1 1 1 1 1 1 1 1 1 1 1 1 1
symmnumber: 1
zpe: 865234.9 jmol-1
zpe.correction: 0.329551 hartree
zpe.thermalcorrener: 0.350434 hartree
zpe.thermalcorrenthalpy: 0.351378 hartree
zpe.thermalcorrgfe: 0.276654 hartree
zpe.sumelectzpe: -1068.301139 hartree
zpe.sumelectthermal: -1068.280256 hartree
zpe.sumelectthermalent: -1068.279312 hartree
zpe.sumelectthermalfe: -1068.354036 hartree
dipole: -0.9615 0.1570 2.0121
dipole: 2.2356
quadrupole: -118.9180 -128.0722 -141.9409
quadrupole: -4.4534 7.1434 6.9563
quadrupole: 10.7257 1.5715 -12.2972 -4.4534 7.1434 6.9563
hfenergy: -1068.6306898 hartree
pointgroup: C01 [X(C19H18N2O3)]
dipole: -0.3662904 -0.04161 0.7985563 debye
polarizability: 296.7543364|25.0373315|279.9707732|-17.1984836|34.015807|154.586442 unknown
InChI: InChI=1S/C19H18N2O3/c1-2-23-19(22)20-13-16-21-17(14-9-5-3-6-10-14)18(24-16)15-11-7-4-8-12-15/h3-12,20H,2,13H2,1H3
charge 0 multiplicity 1
42 atoms
O  0.575616 0.610083 -0.759249
O  5.118523 -0.78995 0.550329
O  4.657857 0.547846 -1.34004
N  -0.148913 -1.535068 -0.997953
N  3.23376 -1.193261 -0.649432
C  -0.769741 0.562415 -0.287314
C  -1.19942 -0.766223 -0.416493
C  -1.340718 1.851623 0.112391
C  -2.449572 -1.443107 -0.021475
C  0.867428 -0.705512 -1.17748
C  2.235825 -1.005901 -1.710955
C  -2.734897 2.112129 -0.008052
C  -0.486077 2.887962 0.58523
C  -2.831393 -2.62853 -0.708335
C  -3.258115 -0.986425 1.055576
C  -3.259344 3.368534 0.357509
C  -1.01676 4.142824 0.947123
C  -4.005905 -3.320911 -0.348387
C  -4.430913 -1.683216 1.415237
C  -2.40586 4.388533 0.841127
C  -4.815212 -2.849268 0.711795
C  4.353439 -0.390745 -0.559234
C  6.377345 -0.018858 0.759347
C  7.03394 -0.588459 2.012926
H  2.153668 -1.914073 -2.334203
H  2.596661 -0.174375 -2.34051
H  -3.401024 1.340685 -0.40656
H  0.589787 2.7010 0.65976
H  -2.189757 -2.996313 -1.515068
H  -2.95868 -0.101593 1.626756
H  3.107104 -1.930049 0.045504
H  -4.333772 3.555658 0.253616
H  -0.346574 4.929431 1.310624
H  -4.288778 -4.229558 -0.89145
H  -5.039246 -1.321962 2.252003
H  -2.817015 5.36402 1.122976
H  -5.727205 -3.38745 0.99304
H  7.012803 -0.132774 -0.137741
H  6.121173 1.050792 0.865857
H  7.9786 -0.051857 2.216453
H  6.373752 -0.474838 2.889777
H  7.263606 -1.660261 1.885672
