program: Gaussian 09
title: 000036332
version: EM64L-G09RevD.01
frameworkgroup: C1[X(C10H13NO)]
method: RPBEPBE
basis: SDD
operation: Freq
keyword: #p
keyword: freq=noraman
keyword: PBEPBE/SDD
title: #p freq=noraman PBEPBE/SDD
converged: NO YES NO NO
title: Mulliken charges:
elementType: O N C C C C C C C C C C H H H H H H H H H H H H H
charge: -0.255803 -0.442787 0.334843 -0.562159 0.289090 -0.393752 -0.358208 -0.670087 -0.254501 -0.234778 0.208882 -0.805233 0.233413 0.193015 0.228476 0.307400 0.212451 0.220088 0.235783 0.320629 0.226080 0.227378 0.237144 0.269259 0.233377
chargesum: 0.00000
title: Mulliken charges with hydrogens summed into heavy atoms:
elementType: O N C C C C C C C C C C
charge: -0.255803 -0.122158 0.334843 -0.135731 0.289090 -0.165276 -0.050807 -0.001765 -0.028421 -0.007400 0.208882 -0.065453
polarizability: 1.57416437e+02 -5.35657725e+00 1.33401622e+02 -1.77499642e+00 -7.62317353e+00 6.55752609e+01
1716.lowfreq: -91.9963 -12.4286 -8.8909 -0.0006 -0.0005 0.0006 4.6100 49.0243 72.9870
frequency: -91.9900 48.9242 72.9846 93.9411 124.0826 160.5109 197.9226 238.6923 291.3723 317.6184 344.3000 422.7930 472.8683 514.7160 540.1854 564.3815 586.8442 626.0526 644.5175 746.9118 763.3960 768.4017 787.7213 824.2505 886.3521 932.2046 956.4398 964.4568 986.5143 997.8665 1028.6933 1028.8851 1051.5654 1061.0844 1119.7940 1173.7318 1194.1111 1218.3437 1238.0485 1268.2392 1298.0926 1317.6646 1373.6238 1380.9438 1390.6274 1434.5503 1446.7992 1462.3840 1467.9899 1469.9843 1486.9029 1500.1314 1517.6442 1595.6521 1616.5559 1635.6927 2957.3161 2981.7672 2986.4291 3036.3267 3071.0433 3076.1597 3087.6203 3118.1688 3136.7379 3136.9731 3160.2374 3192.7383 3539.5500
redmass: 1.0456 4.9367 2.7981 3.5279 3.3590 2.6361 1.2259 3.4217 3.8833 3.6869 3.4362 2.8311 3.4195 3.4231 3.9863 3.4960 3.0544 1.2319 5.4984 3.8742 3.4262 1.3237 1.1957 4.0478 1.3591 5.8250 1.3674 2.5081 1.6628 1.3068 1.6819 1.6697 2.0638 1.9081 1.7250 1.0973 1.8030 2.9464 1.3630 1.6920 1.7866 1.4875 1.2516 5.3393 1.1987 1.8368 1.6828 1.4169 1.0485 1.0651 1.0975 1.3646 1.7149 5.8582 6.0449 4.8027 1.0685 1.0358 1.0385 1.0925 1.0984 1.0996 1.1003 1.0876 1.0900 1.0973 1.0983 1.0951 1.0757
irintensity: 0.0216 8.4321 0.9265 0.1089 1.8858 4.5401 1.7192 0.9570 0.8834 1.5522 0.7631 1.2053 13.0740 12.9914 8.1774 0.3626 0.1269 59.4599 1.3956 1.3547 8.8355 84.5312 4.1413 0.9501 2.0798 6.6916 5.2173 4.6788 16.0202 3.1800 4.3697 6.7053 19.7006 6.0747 1.1114 0.0691 6.7898 41.8169 1.7781 21.6319 76.1013 5.2286 35.0621 77.7193 10.7644 199.2032 9.9364 2.1530 21.4092 7.4508 10.4921 89.9354 216.4019 72.5218 2.4672 137.0265 42.1500 33.0204 9.7202 9.8050 16.0284 57.0773 31.2755 10.7168 12.6956 12.5524 27.5055 9.1152 19.9644
temp: 298.150 k
press: 1.00000 atm
elementType: 8 7 6 6 6 6 6 6 6 6 6 6 1 1 1 1 1 1 1 1 1 1 1 1 1
symmnumber: 1
zpe: 545114.5 jmol-1
zpe.correction: 0.207623 hartree
zpe.thermalcorrener: 0.218998 hartree
zpe.thermalcorrenthalpy: 0.219942 hartree
zpe.thermalcorrgfe: 0.169859 hartree
zpe.sumelectzpe: -517.967613 hartree
zpe.sumelectthermal: -517.956239 hartree
zpe.sumelectthermalent: -517.955295 hartree
zpe.sumelectthermalfe: -518.005378 hartree
dipole: 0.7607 4.2213 -0.6592
dipole: 4.3396
quadrupole: -67.7698 -69.7382 -75.2016
quadrupole: -8.7738 1.6102 -1.2419
quadrupole: 3.1334 1.1650 -4.2984 -8.7738 1.6102 -1.2419
hfenergy: -518.1752365 hartree
pointgroup: C01 [X(C10H13N1O1)]
dipole: -0.4278416 -1.6308943 -0.2685792 debye
dipolederiv: -0.818804 -0.0229125 -0.0186244 -0.5670882 -0.824954 -0.1078258 -0.1351878 -0.0912424 -0.3609235 -1.8367427 0.0464519 -0.0464867 -0.064803 -0.3755102 -0.019063 -0.0738122 0.0147485 -0.3073481 -0.2384048 0.0770724 0.0086523 -0.0133553 0.1843595 0.017826 -0.0155392 0.0474161 -0.123031 0.1246186 0.0287799 -0.0376261 0.030616 0.0496087 0.0218952 -0.0234886 0.096423 0.1232676 0.9008383 -0.254213 -0.0115401 -0.4989621 0.1043068 -0.0065329 -0.0610173 -0.0156032 0.0750346 0.1054325 0.0210176 0.0186893 0.0441244 -0.0096758 0.0449789 0.0199881 0.0273258 -0.151929 -0.1563083 0.0151443 0.005326 0.1930835 -0.130108 0.0151529 0.0403311 0.0046671 -0.1575188 0.0726953 0.0083975 0.0060261 0.0024485 -0.0057193 0.0386258 -0.0102411 -0.0289649 -0.0131096 -0.0235548 -0.0688717 0.0044524 -0.0281275 -0.1045165 0.0158607 0.0074774 0.0074032 -0.1658271 0.0199285 0.0301763 0.0114449 -0.0459345 0.128982 0.0596526 0.0047784 0.0565355 -0.1494474 1.9854545 0.0414891 0.0745989 0.6662822 1.005739 0.1822614 0.2268731 0.1533962 0.1941302 -0.2839124 0.1694208 0.0182015 0.2988986 -0.2129936 -0.0310324 0.0221351 -0.0295794 0.0540604 -0.0987398 -0.0941935 -0.1226653 -0.0170031 0.0343813 -0.0050876 -0.0608603 -0.0104181 0.0238433 -0.0550031 0.0812907 0.1595905 0.032495 -0.0181625 -0.0110676 0.1069168 -0.0230249 -0.0489112 -0.0556672 -0.0883352 -0.025206 -0.1237244 0.0106547 -0.0387563 -0.0353048 -0.0335381 0.1326708 0.1195402 -0.074445 -0.0174213 -0.04304 0.0982174 -0.0151881 -0.0108687 -0.020562 0.1749258 -0.0936085 -0.033312 -0.1159498 -0.0690266 0.0819709 -0.0325595 -0.0784515 -0.0235583 0.0199255 0.1033757 0.0253087 -0.004693 -0.0023617 -0.2460711 -0.0091297 0.0002517 -0.0155022 0.0625707 -0.046454 0.0039763 0.1225416 0.0609094 0.0989475 -0.0264549 0.0762383 0.0018368 -0.0145116 0.2107588 0.0309452 -0.0146366 0.0635508 0.1071516 -0.0338075 0.0012804 -0.0486561 0.2610156 -0.096418 0.1001964 -0.0018364 0.0879128 0.0393975 -0.0144902 -0.0033253 -0.0175878 0.1622813 0.0789748 0.010349 -0.0029958 0.0332363 -0.1210754 -0.0467938 0.0008724 -0.0495099 0.1464413 0.0652795 -0.018712 0.0555321 0.0289871 -0.0097018 0.097839 0.0133029 0.113166 -0.0019058 -0.0490842 -0.0344149 -0.0073771 -0.1029495 0.0662309 -0.0117817 -0.0148066 -0.0127739 0.1294689 0.0658052 -0.0006061 -0.057997 0.0338312 0.0485405 -0.0845217 0.0024577 -0.102397 -0.0651729 unknown
polarizability: 156.3192921|-7.3201135|134.3844776|3.6554707|7.4845138|65.6895504 unknown
InChI: InChI=1S/C10H13NO/c1-3-9-6-4-5-7-10(9)11-8(2)12/h4-7,11H,3H2,1-2H3
charge 0 multiplicity 1
25 atoms
O  2.729333 1.302541 0.273601
N  1.196073 -0.437936 -0.132884
C  -1.245783 -0.554533 -0.298804
C  -1.191654 -2.062662 -0.521485
C  -0.065829 0.228524 -0.084074
C  -2.498671 0.100654 -0.263122
C  -0.165187 1.624201 0.16222
C  -0.997657 -2.867737 0.794527
C  -2.606596 1.487336 -0.017587
C  -1.432402 2.2421 0.195759
C  2.481481 0.085059 0.03237
C  3.587711 -0.964214 -0.103613
H  -2.138264 -2.385951 -0.991137
H  -0.399294 -2.338033 -1.24962
H  -3.405374 -0.493001 -0.433478
H  0.74859 2.198886 0.321422
H  -0.06932 -2.583205 1.323566
H  -0.959108 -3.953773 0.592458
H  -1.836245 -2.675408 1.486272
H  1.153636 -1.439552 -0.328951
H  -3.589992 1.968793 0.00342
H  -1.49638 3.318823 0.387855
H  3.510137 -1.73249 0.688186
H  4.559919 -0.460249 -0.009655
H  3.545578 -1.475173 -1.083447
