program: Gaussian 09
title: 000036336
version: EM64L-G09RevD.01
frameworkgroup: C1[X(C10H20O5)]
method: RPBEPBE
basis: SDD
operation: Freq
keyword: #pfreq=noraman
keyword: PBEPBE/SDD
title: #p freq=noraman PBEPBE/SDD
converged: YES YES NO NO
title: Mulliken charges:
elementType: O O O O O C C C C C C C C C C H H H H H H H H H H H H H H H H H H H H
charge: -0.273622 -0.271644 -0.269551 -0.282037 -0.277111 -0.226809 -0.241895 -0.282040 -0.252701 -0.326419 -0.250753 -0.223697 -0.243485 -0.306714 -0.242912 0.206756 0.177630 0.172591 0.210812 0.202329 0.199019 0.175196 0.204897 0.228073 0.190160 0.198138 0.185359 0.233081 0.199196 0.208219 0.178081 0.206286 0.198319 0.192146 0.205101
chargesum: 0.00000
title: Mulliken charges with hydrogens summed into heavy atoms:
elementType: O O O O O C C C C C C C C C C
charge: -0.273622 -0.271644 -0.269551 -0.282037 -0.277111 0.157577 0.141507 0.119309 0.127392 0.091815 0.132744 0.208580 0.142815 0.097892 0.154335
polarizability: 1.46818698e+02 3.05456736e+00 1.36148175e+02 -1.72187892e+00 6.45198703e-01 9.74687293e+01
1716.lowfreq: -6.5392 -1.7370 -0.0005 0.0005 0.0005 6.3026 30.2082 41.8181 51.9380
frequency: 30.1713 41.7610 51.8765 67.1064 88.4092 105.0838 134.0637 147.0235 167.1908 178.4066 182.4234 209.5394 224.4798 285.2017 299.5597 315.3454 322.0677 335.8103 378.8193 431.9056 488.6407 508.3799 515.2692 541.5751 773.6261 779.8660 791.2773 793.3583 806.9541 837.4909 915.2270 924.9923 929.2932 941.8957 974.2518 1024.3941 1029.5035 1034.7461 1044.6651 1051.4155 1064.7599 1075.3795 1078.7480 1084.8881 1094.9121 1105.5358 1112.1626 1125.1042 1132.7951 1183.9614 1190.6377 1202.3963 1211.1870 1218.5090 1247.4042 1252.6861 1259.5560 1268.2018 1270.6907 1325.8535 1329.6683 1337.8641 1345.1640 1360.7513 1362.1401 1387.6928 1388.8299 1398.6797 1412.4426 1438.1109 1451.3385 1452.0342 1453.0314 1453.2273 1461.6868 1471.4871 1472.3548 1472.9043 1477.9036 2910.4058 2913.3552 2916.6912 2921.2345 2930.0718 2940.7831 2952.1685 2959.7513 2967.2449 2978.5286 2981.6955 2983.3057 2984.9153 2987.4655 2993.7307 2999.3654 3028.8891 3049.5141 3061.8660 3080.9496
redmass: 3.4056 4.4979 3.9461 5.5870 2.9276 2.4070 3.7306 3.7212 5.2280 2.8771 2.6137 2.8938 2.4491 3.1451 2.7819 2.7744 2.6980 2.1965 3.7260 2.7785 2.3190 2.8405 2.8167 3.1316 2.7796 2.6214 1.9279 1.9875 1.6823 3.3145 2.2692 2.2148 2.3647 2.4948 2.6518 2.7752 2.7139 2.5548 2.6402 2.3304 3.6267 2.5759 3.2127 4.1700 3.6770 2.5816 2.8914 2.1833 2.0937 1.1381 1.0893 1.1382 1.1574 1.1832 1.1199 1.1230 1.1323 1.1203 1.1051 1.2115 1.2244 1.2382 1.2945 1.2675 1.2715 1.3556 1.3348 1.4705 1.5663 1.0864 1.0832 1.0835 1.0833 1.0808 1.0823 1.0850 1.0876 1.0853 1.0883 1.0584 1.0583 1.0595 1.0581 1.0600 1.0586 1.0677 1.0608 1.0650 1.1013 1.0991 1.0660 1.0965 1.0992 1.1001 1.1033 1.1048 1.1012 1.0966 1.1009
irintensity: 0.3845 1.8065 1.9436 1.1665 0.5723 8.1915 4.1609 4.8311 13.8426 3.8661 1.8177 7.4089 10.8207 6.5272 2.1134 0.3101 1.5361 0.5894 1.2353 17.8871 4.5972 11.2705 2.7116 0.3259 6.5634 4.3145 5.8500 2.4176 3.9736 16.5119 19.6545 12.7122 58.4159 28.0766 26.3467 8.1975 19.4866 9.6065 33.3535 22.9418 84.2691 82.3406 4.0692 140.9178 30.0167 54.0640 64.4480 27.7682 15.3324 8.1215 1.2276 5.6890 7.5215 12.8632 1.0021 4.4169 11.0273 17.7205 1.6482 0.4596 18.3536 29.5584 8.8377 2.9905 10.7994 1.5762 1.5804 4.1000 5.6628 7.8563 11.6165 6.9122 9.1251 15.0753 4.1035 6.4147 7.3893 6.9849 11.2776 10.2405 37.9297 58.6390 39.2922 178.8129 173.6423 32.1405 50.8438 90.1156 39.1801 89.5481 28.4145 32.9688 77.7265 85.6936 38.3960 45.2653 22.6765 42.9807 44.8577
temp: 298.150 k
press: 1.00000 atm
elementType: 8 8 8 8 8 6 6 6 6 6 6 6 6 6 6 1 1 1 1 1 1 1 1 1 1 1 1 1 1 1 1 1 1 1 1
symmnumber: 1
zpe: 781626.1 jmol-1
zpe.correction: 0.297706 hartree
zpe.thermalcorrener: 0.314461 hartree
zpe.thermalcorrenthalpy: 0.315405 hartree
zpe.thermalcorrgfe: 0.252074 hartree
zpe.sumelectzpe: -767.831436 hartree
zpe.sumelectthermal: -767.814680 hartree
zpe.sumelectthermalent: -767.813736 hartree
zpe.sumelectthermalfe: -767.877067 hartree
dipole: -0.9673 3.1869 -1.3006
dipole: 3.5754
quadrupole: -74.5075 -86.7034 -92.5139
quadrupole: 2.6577 -4.8207 2.4019
quadrupole: 10.0674 -2.1285 -7.9390 2.6577 -4.8207 2.4019
hfenergy: -768.1291413 hartree
pointgroup: C01 [X(C10H20O5)]
dipole: 1.200216 0.4400222 0.5870486 debye
polarizability: 137.1327329|-4.3509601|145.8372394|0.5397144|1.6958408|97.4656301 unknown
InChI: InChI=1S/C10H20O5/c1-2-12-5-6-14-9-10-15-8-7-13-4-3-11-1/h1-10H2
charge 0 multiplicity 1
35 atoms
O  -0.447803 2.154802 0.534538
O  -2.856926 0.896286 -0.869371
O  2.098463 0.858425 -0.327507
O  -1.60124 -2.507646 -0.090977
O  1.479949 -1.930823 0.430726
C  -1.676061 2.816833 0.087092
C  0.762248 2.836207 0.072062
C  -2.836659 1.840142 0.255755
C  1.971585 2.035183 0.53288
C  -2.848641 -0.526293 -0.510442
C  3.053609 -0.133997 0.170908
C  -1.462255 -1.035517 -0.079299
C  2.632475 -1.498213 -0.35962
C  -0.544544 -3.246525 0.595854
C  0.83225 -3.146959 -0.071279
H  -1.604198 3.100736 -0.984828
H  -1.853208 3.73853 0.68848
H  0.814796 3.864074 0.49964
H  0.765588 2.913672 -1.03655
H  -2.741801 1.316152 1.22793
H  -3.793233 2.402407 0.246888
H  2.885846 2.668184 0.465481
H  1.827854 1.730152 1.591656
H  -3.147567 -1.053862 -1.432234
H  -3.60074 -0.746669 0.276197
H  3.048699 -0.166009 1.281263
H  4.081668 0.114468 -0.174356
H  -0.683819 -0.698395 -0.788477
H  -1.169571 -0.677497 0.928176
H  2.362433 -1.413742 -1.434501
H  3.472127 -2.223549 -0.259654
H  -0.893067 -4.294697 0.580367
H  -0.445878 -2.912138 1.65179
H  1.449936 -4.039037 0.181972
H  0.707683 -3.106287 -1.17556
