program: Gaussian 09
title: 000036293
version: EM64L-G09RevD.01
frameworkgroup: C1[X(C4H8N4O3)]
method: RPBEPBE
basis: SDD
operation: Freq
keyword: #pfreq=noraman
keyword: PBEPBE/SDD
title: #p freq=noraman PBEPBE/SDD
converged: NO YES NO NO
title: Mulliken charges:
elementType: O O O N N N N C C C C H H H H H H H H
charge: -0.188420 -0.219388 -0.237499 -0.175442 -0.459307 0.029367 -0.648391 -0.354234 -0.644362 0.383402 0.292360 0.258444 0.248793 0.232700 0.243155 0.229016 0.337685 0.318681 0.353440
chargesum: 0.00000
title: Mulliken charges with hydrogens summed into heavy atoms:
elementType: O O O N N N N C C C C
charge: -0.188420 -0.219388 -0.237499 -0.175442 -0.121622 0.029367 0.023731 0.153003 0.060508 0.383402 0.292360
polarizability: 1.11559739e+02 3.21425293e+00 9.97614673e+01 -2.33769504e+00 3.74612789e+00 4.71180727e+01
1716.lowfreq: -12.1388 -2.7707 -0.0007 -0.0006 0.0002 3.9109 10.3458 38.5658 60.5436
frequency: 7.1637 38.2418 60.5380 116.7543 124.9076 168.8522 211.3415 246.5634 285.1837 336.5185 359.4423 383.9211 388.4930 485.8554 501.8437 541.6010 569.2454 694.8133 720.7837 726.9651 771.5284 785.6279 833.5023 893.5324 934.1895 986.6896 1061.1782 1084.9968 1120.5624 1181.0036 1223.5966 1311.0574 1329.9113 1348.8899 1368.5145 1391.9138 1442.4657 1472.7542 1480.8162 1484.0708 1616.8468 1666.4686 1718.2791 2998.5839 3036.4486 3095.9897 3099.7437 3119.7845 3407.7330 3536.0602 3691.0922
redmass: 5.4227 2.8936 4.8655 6.9707 5.4185 4.8885 1.1153 10.0918 6.8616 2.3906 5.4011 1.1722 6.5029 5.4403 6.7944 1.1554 3.9604 9.3574 2.2037 3.7482 2.1715 1.3932 3.8151 4.1849 2.5593 2.5888 2.0690 2.1027 3.0424 2.1764 4.1697 2.3550 1.5045 1.3175 3.8503 1.4306 1.1121 1.0441 1.1123 1.8977 1.1908 5.0210 9.3280 1.0351 1.0601 1.1017 1.0990 1.1041 1.0769 1.0461 1.1041
irintensity: 13.3688 0.4563 5.3404 4.1989 13.4755 0.8233 0.4707 6.9191 0.5425 2.6470 6.7449 65.6115 4.4725 2.6856 3.3418 239.1465 45.6893 2.6361 2.3713 5.3312 94.9666 162.8599 25.7503 31.5141 177.8746 3.3473 7.5209 16.3859 52.9999 9.6656 157.3910 124.1667 31.6533 3.1735 163.2311 41.2030 24.1290 10.1945 78.6915 925.8222 34.3232 10.0111 459.6215 17.4940 10.3715 9.7135 23.1341 7.3189 85.7752 51.1795 43.4815
temp: 298.150 k
press: 1.00000 atm
elementType: 8 8 8 7 7 7 7 6 6 6 6 1 1 1 1 1 1 1 1
symmnumber: 1
zpe: 367629.5 jmol-1
zpe.correction: 0.140023 hartree
zpe.thermalcorrener: 0.152025 hartree
zpe.thermalcorrenthalpy: 0.152969 hartree
zpe.thermalcorrgfe: 0.099159 hartree
zpe.sumelectzpe: -601.018892 hartree
zpe.sumelectthermal: -601.006889 hartree
zpe.sumelectthermalent: -601.005945 hartree
zpe.sumelectthermalfe: -601.059755 hartree
dipole: 0.2838 3.5313 0.6043
dipole: 3.5939
quadrupole: -56.4637 -72.7156 -63.2843
quadrupole: -22.0967 -2.5952 0.1409
quadrupole: 7.6908 -8.5611 0.8703 -22.0967 -2.5952 0.1409
hfenergy: -601.1589142 hartree
pointgroup: C01 [X(C4H8N4O3)]
dipole: -0.2154019 1.3756236 -0.245935 debye
dipolederiv: -0.6091187 0.041472 -0.0038058 -0.1115211 -0.9218322 0.0981884 0.0298655 0.0797879 -0.3252073 -0.8225057 0.1983241 0.0021237 0.2513468 -0.8435261 0.0466141 0.007108 0.0430675 -0.3562783 -0.7826356 0.789638 -0.0228653 0.1683455 -0.5930335 0.018627 0.004217 0.000839 -0.1849305 -0.9156794 0.2158915 -0.0196561 0.7331371 -0.9709878 0.0163721 -0.0781112 0.0716452 -0.1795028 -2.1605489 -0.3193119 0.1388858 -0.3038092 -0.5493996 0.0450849 0.1798544 0.0518003 -0.3654951 0.2508861 -0.7373333 0.0196618 -0.6822056 1.1332646 -0.0713721 0.1013554 -0.1013006 -0.0414386 -0.7679916 -0.4590173 0.0442797 -0.5233906 -0.8788631 0.0505349 0.0639952 0.0527945 -0.7809421 0.2766693 0.1314163 0.0164172 0.1781307 0.134003 0.0353419 0.0011758 -0.0356408 0.2213101 0.0101049 -0.036989 -0.0029072 -0.0411855 0.0247809 -0.0170874 -0.0007772 0.0396871 -0.0341354 2.2479286 -0.2001676 -0.0636402 0.3563305 1.3508912 -0.173397 -0.1747783 -0.1142014 0.3648481 2.3793316 0.3087293 -0.166798 -0.0362758 1.5318754 -0.1454184 -0.1594405 -0.1673306 0.3983419 0.0942738 0.0137994 -0.0855886 -0.0265804 0.0287323 0.0683047 -0.0578825 0.0438634 0.0340623 0.0027224 -0.0131989 0.0502906 0.0658781 0.0257647 -0.1088159 0.0191856 -0.0360898 0.0385759 0.094968 0.0233962 -0.0415224 0.067512 -0.0335283 0.1120973 -0.0362715 0.0449228 0.0006164 0.0013151 0.0974958 0.0788419 0.0639451 0.0503997 -0.0677238 0.0409375 -0.0469207 0.0224659 -0.0728268 -0.1366271 0.0218431 -0.1319749 0.0182645 0.0136131 0.0229058 0.0002756 0.0757784 0.3649799 -0.0044295 0.0088715 -0.1079852 0.1604788 0.0258781 0.0122633 0.021524 0.3079282 0.177708 0.0489365 0.0151084 0.0704935 0.1492018 0.0273667 0.0110587 0.027628 0.4049129 0.2304188 0.0379754 0.0104599 0.009809 0.1835135 0.0257912 0.013339 0.0236488 0.3990898 unknown
polarizability: 112.009133|-2.2542963|99.3030862|-1.5067837|-4.1764164|47.1270602 unknown
InChI: InChI=1S/C4H8N4O3/c1-2-8(7-11)4(10)6-3(5)9/h6H,2,5H2,1H3
charge 0 multiplicity 1
19 atoms
O  0.296375 -1.786894 0.350605
O  3.10158 -0.955804 0.002533
O  -2.421217 1.918063 0.056958
N  -1.169446 0.044287 0.231801
N  1.150224 0.408427 -0.004876
N  -1.242343 1.427129 0.047256
N  3.268046 1.348937 -0.295727
C  -2.365575 -0.811224 0.416496
C  -2.939454 -1.309429 -0.926999
C  0.167749 -0.556241 0.198611
C  2.558651 0.169145 -0.090164
H  -2.054126 -1.660853 1.044194
H  -3.109758 -0.19992 0.955776
H  -3.249587 -0.466399 -1.567624
H  -2.196644 -1.920962 -1.466445
H  -3.826433 -1.938048 -0.733105
H  0.776788 1.36386 -0.097333
H  2.843345 2.271366 -0.372116
H  4.279325 1.265359 -0.36934
