program: Gaussian 09
title: 000036292
version: EM64L-G09RevD.01
frameworkgroup: C1[X(C8H18O)]
method: RPBEPBE
basis: SDD
operation: Freq
keyword: #pfreq=noraman
keyword: PBEPBE/SDD
title: #p freq=noraman PBEPBE/SDD
converged: YES YES NO NO
title: Mulliken charges:
elementType: O C C C C C C C C H H H H H H H H H H H H H H H H H H
charge: -0.316308 0.339520 0.074664 -0.373690 -0.741037 -0.700878 -0.683271 -0.701497 -0.697949 0.176688 0.181195 0.207816 0.227610 0.219708 0.218434 0.230232 0.220325 0.192177 0.212707 0.199465 0.228182 0.222828 0.207539 0.205348 0.196450 0.243933 0.209810
chargesum: 0.00000
title: Mulliken charges with hydrogens summed into heavy atoms:
elementType: O C C C C C C C C
charge: -0.316308 0.339520 0.251352 0.015321 -0.075285 -0.058144 -0.042918 -0.065782 -0.047755
polarizability: 1.04055107e+02 -1.80276500e+00 9.15061079e+01 -4.78431221e-01 9.35324010e-02 8.09785473e+01
1716.lowfreq: -13.2658 -8.3343 -5.8011 -0.0009 -0.0007 -0.0006 16.4550 80.1661 102.2186
frequency: 15.5521 80.1315 102.2002 166.8567 172.7463 192.1016 224.8956 233.1104 248.4052 266.3740 287.3258 332.4214 357.8785 369.9937 428.4964 440.5360 472.7180 508.8849 685.3955 771.9156 806.9093 835.8891 900.1899 904.3926 928.9615 940.4869 969.8526 997.7810 1017.2493 1024.2585 1037.9693 1111.0931 1114.0638 1171.8055 1184.0403 1238.6722 1254.2170 1269.9040 1299.3998 1332.0383 1350.2591 1367.5578 1373.7421 1375.7923 1382.3259 1396.9618 1446.1940 1449.8518 1459.9482 1463.1189 1463.5708 1470.6871 1471.9020 1478.3112 1482.0935 1489.6582 1494.7515 2952.5055 2976.0127 2978.0288 2979.8390 2983.1488 2984.0337 2989.4845 3036.1821 3067.6473 3071.8082 3075.3371 3079.3272 3080.8350 3088.0694 3091.2180 3094.2382 3094.3331 3100.2041
redmass: 2.7898 2.6684 1.9775 1.0269 1.7424 1.4824 1.5373 1.2632 1.3690 1.0524 2.0508 2.4124 2.3840 2.3795 2.5764 2.5804 2.6292 2.6046 2.8846 2.0695 1.5577 2.0610 1.6366 1.8258 2.0552 1.2172 1.2575 1.7546 1.4223 1.3939 3.6329 2.0043 2.1569 2.1567 2.0685 2.9844 2.1188 1.5077 1.2556 1.2189 1.5844 1.2329 1.2374 1.2137 1.2137 1.2105 1.0507 1.0749 1.0567 1.0498 1.0484 1.0597 1.0454 1.0551 1.0520 1.0533 1.0524 1.0820 1.0391 1.0391 1.0360 1.0425 1.0470 1.0358 1.0998 1.0991 1.0989 1.0982 1.0983 1.1005 1.1002 1.0990 1.0995 1.0997 1.0993
irintensity: 0.0288 1.6064 1.3081 0.0145 1.0209 0.0943 0.6064 0.4988 0.4056 0.0645 0.7954 1.2291 1.7963 0.4838 2.6524 0.3531 3.4827 1.6295 5.3241 1.2431 5.6174 0.9691 1.9013 15.0399 26.7675 1.2207 11.3760 84.8654 3.9487 1.9457 14.8197 31.3343 16.5484 37.2593 67.5745 29.3165 14.1036 6.9586 0.8934 11.6367 4.2109 12.6043 31.7174 32.9235 28.4935 17.2770 1.7477 2.4623 3.9657 3.6683 1.3558 9.7243 7.8089 11.2037 15.4769 7.2854 19.9886 31.4524 36.7795 15.9675 29.9466 20.4294 56.1247 16.0270 15.2353 60.5056 37.0867 35.9743 21.8272 14.4779 33.3316 76.7954 34.5545 30.0137 53.5565
temp: 298.150 k
press: 1.00000 atm
elementType: 8 6 6 6 6 6 6 6 6 1 1 1 1 1 1 1 1 1 1 1 1 1 1 1 1 1 1
symmnumber: 1
zpe: 639021.7 jmol-1
zpe.correction: 0.243391 hartree
zpe.thermalcorrener: 0.255929 hartree
zpe.thermalcorrenthalpy: 0.256873 hartree
zpe.thermalcorrgfe: 0.204987 hartree
zpe.sumelectzpe: -390.088562 hartree
zpe.sumelectthermal: -390.076023 hartree
zpe.sumelectthermalent: -390.075079 hartree
zpe.sumelectthermalfe: -390.126966 hartree
dipole: 0.5140 0.7019 1.1487
dipole: 1.4410
quadrupole: -56.2001 -59.4195 -59.2000
quadrupole: -1.2553 0.0060 -0.1299
quadrupole: 2.0731 -1.1463 -0.9268 -1.2553 0.0060 -0.1299
hfenergy: -390.3319523 hartree
pointgroup: C01 [X(C8H18O1)]
dipole: 0.214577 0.3108563 0.4227504 debye
polarizability: 103.8630829|-2.4070284|91.6120797|-0.223715|-0.9652152|81.0645992 unknown
InChI: InChI=1S/C8H18O/c1-6-7(2)9-8(3,4)5/h7H,6H2,1-5H3
charge 0 multiplicity 1
27 atoms
O  -0.021105 -0.188942 -0.453897
C  1.394411 -0.230121 0.037008
C  -1.026702 0.686736 0.185011
C  -2.387291 0.120126 -0.276481
C  1.500664 -0.043411 1.566809
C  1.847036 -1.65092 -0.364249
C  2.241938 0.825179 -0.717397
C  -0.86525 2.171214 -0.205827
C  -2.656243 -1.309495 0.234175
H  -0.961916 0.585438 1.290348
H  -3.185977 0.80531 0.07177
H  -2.405402 0.134885 -1.38388
H  0.862089 -0.77153 2.098981
H  2.546409 -0.211042 1.883279
H  1.216372 0.975823 1.885081
H  1.679078 -1.804609 -1.444404
H  1.261525 -2.409244 0.184382
H  2.920425 -1.800489 -0.147137
H  1.972856 1.854664 -0.425863
H  3.317902 0.680029 -0.504364
H  2.083625 0.720178 -1.804869
H  -0.828006 2.27224 -1.305536
H  -1.722939 2.760159 0.171197
H  0.054906 2.613342 0.21415
H  -2.697901 -1.337429 1.340296
H  -1.848963 -1.985304 -0.09551
H  -3.61764 -1.698087 -0.149173
