program: Gaussian 09
title: 000036735
version: EM64L-G09RevD.01
frameworkgroup: C1[X(C10H17N6O13P3)]
method: RPBEPBE
basis: SDD
operation: Freq
keyword: #p
keyword: freq=noraman
keyword: PBEPBE/SDD
title: #p freq=noraman PBEPBE/SDD
converged: YES YES NO NO
title: Mulliken charges:
elementType: P P P O O O O O O O O O O O O O N N N N N N C C C C C C C C C C H H H H H H H H H H H H H H H H H
charge: 1.467762 1.490996 1.463012 -0.265467 -0.500123 -0.498720 -0.526078 -0.789540 -0.670515 -0.561611 -0.334109 -0.673305 -0.550524 -0.658902 -0.664510 -0.704142 -0.172606 -0.435049 -0.242538 -0.033405 -0.608151 -1.125198 -0.209279 -0.183778 -0.105825 -0.081292 -0.315929 0.409084 -0.147518 -0.041312 0.051611 0.164448 0.388794 0.298984 0.272429 0.271403 0.257874 0.308566 0.395314 0.380336 0.298960 0.389409 0.408460 0.326645 0.360517 0.435527 0.408043 0.421341 0.429907
chargesum: 0.00000
title: Mulliken charges with hydrogens summed into heavy atoms:
elementType: P P P O O O O O O O O O O O O O N N N N N N C C C C C C C C C C
charge: 1.467762 1.490996 1.463012 -0.265467 -0.104809 -0.118384 -0.526078 -0.789540 -0.262055 -0.561611 -0.334109 -0.265262 -0.550524 -0.237561 -0.234603 -0.704142 -0.172606 -0.045640 -0.242538 -0.033405 0.079011 -0.689671 0.179515 0.115206 0.166604 0.190112 0.250511 0.409084 0.151442 -0.041312 0.051611 0.164448
polarizability: 2.91092016e+02 -5.04742719e+00 2.75206885e+02 -2.46521510e+01 -8.62922994e+00 2.12157821e+02
1716.lowfreq: -8.9829 -5.8224 -0.0011 -0.0004 0.0003 7.0457 20.9352 31.6549 38.4662
frequency: 20.8388 31.6493 38.4362 56.4653 59.6608 70.2591 74.8334 77.4560 85.4668 90.6821 99.7593 113.2329 118.2451 136.9334 144.5170 149.5667 162.0540 176.2533 188.7553 201.0042 209.3234 215.0371 235.4081 239.2213 246.1654 251.3337 261.8368 268.2560 279.5257 283.1174 289.7204 296.7472 300.9212 310.2157 333.4807 342.8985 351.4614 353.4127 364.1711 367.5245 369.4199 379.6277 389.3485 402.0007 412.0532 420.7700 468.6191 478.4482 506.3300 522.9625 533.0696 545.5170 562.5023 586.7889 615.1509 621.8467 632.2308 654.2167 659.5272 676.1755 682.1756 694.0871 700.0439 709.1462 729.6557 740.5009 747.7070 760.4720 768.0857 792.5442 806.9206 818.4524 826.0482 836.7733 863.6806 873.0873 882.6677 909.4965 920.2287 943.6820 953.6019 971.1077 992.8194 1004.7695 1006.3667 1016.4249 1019.7331 1026.0948 1031.6496 1046.1812 1061.1500 1087.0891 1093.9522 1100.7298 1108.9228 1163.6430 1173.8218 1182.4421 1210.3339 1216.1276 1224.4065 1230.9153 1246.7961 1275.4556 1280.1873 1305.2846 1309.0670 1315.9018 1318.0038 1326.0709 1341.5619 1366.3314 1375.6767 1385.3209 1393.8458 1396.3903 1403.8175 1439.0772 1497.2428 1520.2963 1540.5444 1587.0915 1609.8049 1643.8708 2527.1059 2760.3503 2976.2433 3021.0037 3030.7470 3058.5824 3073.6365 3087.8368 3236.2493 3275.5667 3417.6142 3546.1146 3552.3480 3594.3532 3602.0066 3616.4813 3704.1178
redmass: 9.2431 7.7766 7.4991 8.9119 8.1346 7.9587 6.9784 7.9437 9.5774 7.9785 7.0606 8.0515 3.4799 4.6029 4.2425 9.2948 5.3015 6.8186 6.9816 7.0704 7.1173 8.1188 4.1566 7.4559 5.2222 3.0198 6.8164 3.4812 4.5801 3.4358 3.6360 4.0391 2.2622 1.7418 8.5842 4.2704 3.9220 4.2429 2.4538 4.7014 2.0308 4.7989 7.2774 6.2561 6.3314 9.8849 10.6212 7.9160 4.3308 5.7673 5.8101 1.1618 3.0926 1.3717 2.1684 4.5842 5.0620 6.8072 6.2295 9.6748 9.0752 10.6861 7.2330 6.6204 12.6764 5.0352 2.5788 7.9101 7.2659 9.5770 1.8742 1.8650 9.1566 3.3615 3.4458 1.1923 2.8650 4.2772 2.7633 8.2603 6.1759 1.5808 3.2019 4.3209 2.7184 1.3991 2.1958 1.5883 3.1051 3.3354 3.3976 6.2067 2.0337 4.0125 3.5392 2.1309 1.2500 3.7595 1.3415 1.4548 1.3677 1.5480 1.3775 2.1212 1.5253 1.4189 1.2561 1.2951 1.4277 1.9616 1.9091 1.4518 2.3339 1.3712 1.4416 3.3677 1.2359 3.8643 1.0799 6.8041 3.7796 3.1813 1.8392 2.9776 1.0784 1.0797 1.0646 1.0875 1.0894 1.0880 1.0959 1.0969 1.0844 1.0993 1.0643 1.0755 1.0454 1.0663 1.0663 1.0672 1.1056
irintensity: 3.4563 6.5655 0.9930 4.2148 3.0475 7.1203 2.1051 3.9770 1.8173 5.0961 5.1144 18.0344 26.1400 28.0734 11.9574 6.9984 4.8165 13.0623 7.8577 5.2299 4.1542 0.7330 8.8293 41.1382 5.2581 49.3265 27.5717 0.9738 9.1473 39.6293 45.6851 41.2289 28.8044 73.9285 12.3727 18.1616 8.7947 76.0554 50.8608 77.3785 73.5119 22.9979 31.0904 34.9757 7.6365 63.2086 0.7252 11.4145 0.5179 9.9713 0.6277 177.0107 46.7116 95.3346 115.9973 60.0354 21.2243 16.0360 24.1094 29.7495 34.5530 60.5760 12.8589 75.8605 153.7880 150.7974 102.8204 152.8664 45.0970 311.7534 29.9060 33.7861 289.7908 22.0820 50.3454 125.0015 1.4485 186.7681 43.1394 277.5390 36.7514 46.1220 78.2183 118.5486 2.0590 149.7535 256.8480 58.1577 22.0332 115.3586 41.0592 87.7144 31.5512 128.6460 76.9651 66.5502 42.3970 43.2681 23.8234 85.9972 103.3572 147.3725 16.9274 0.8090 40.6838 63.8394 244.5462 4.9607 258.1017 81.4453 18.9315 21.4775 34.8959 7.5337 6.1075 147.9490 22.1644 3.3418 7.3683 323.9076 87.7956 247.6184 30.2936 726.5856 814.2215 1767.2398 32.1265 38.3871 8.5373 3.1879 18.5878 3.6342 436.3662 8.5666 91.1826 105.8581 146.8401 83.8807 105.8462 40.7113 51.4382
temp: 298.150 k
press: 1.00000 atm
elementType: 15 15 15 8 8 8 8 8 8 8 8 8 8 8 8 8 7 7 7 7 7 7 6 6 6 6 6 6 6 6 6 6 1 1 1 1 1 1 1 1 1 1 1 1 1 1 1 1 1
symmnumber: 1
zpe: 862616.3 jmol-1
zpe.correction: 0.328553 hartree
zpe.thermalcorrener: 0.361502 hartree
zpe.thermalcorrenthalpy: 0.362446 hartree
zpe.thermalcorrgfe: 0.265326 hartree
zpe.sumelectzpe: -2718.928095 hartree
zpe.sumelectthermal: -2718.895146 hartree
zpe.sumelectthermalent: -2718.894202 hartree
zpe.sumelectthermalfe: -2718.991322 hartree
dipole: 3.4642 8.3766 -1.1454
dipole: 9.1368
quadrupole: -194.3011 -205.0684 -209.1411
quadrupole: 38.2621 -24.9576 -4.1689
quadrupole: 8.5357 -2.2315 -6.3042 38.2621 -24.9576 -4.1689
hfenergy: -2719.2566478 hartree
pointgroup: C01 [X(C10H17N6O13P3)]
dipole: -1.4698762 -3.2788414 -0.1019737 debye
polarizability: 289.016683|-2.5094643|276.5075266|27.9261148|-0.1201882|212.9325116 unknown
InChI: InChI=1S/C10H17N6O13P3/c11-10-13-7-4(8(19)14-10)12-2-16(7)9-6(18)5(17)3(28-9)1-27-32(25,26)29-31(23,24)15-30(20,21)22/h2-3,5-6,9,13,15,17-18,20-21,23,25H,1,11H2
charge 0 multiplicity 1
49 atoms
P  4.446408 -0.887337 0.365601
P  3.436581 1.690781 -1.223468
P  0.643746 2.322304 -0.132087
O  -0.217506 -2.672668 1.770833
O  -1.789446 -2.767693 -1.490393
O  0.004432 -4.504696 -0.72986
O  3.128484 -1.979004 0.282311
O  3.783438 0.708338 0.18575
O  4.669742 -0.803864 2.06941
O  5.663727 -1.27848 -0.55282
O  -2.656935 3.432457 0.011426
O  4.724048 2.833799 -1.254786
O  3.226821 0.8322 -2.535278
O  0.528927 2.685494 1.523759
O  -0.239292 3.503122 -0.950894
O  0.408383 0.774422 -0.493685
N  -1.786047 -0.91448 1.267437
N  -3.350534 -0.567044 -0.646582
N  -1.614175 1.245844 1.952835
N  -3.963376 1.753862 -0.98107
N  -4.92563 0.07312 -2.29245
N  2.257912 2.76089 -0.587143
C  -0.778711 -2.258293 -0.570698
C  0.494433 -3.134388 -0.504817
C  -1.310255 -2.278242 0.905854
C  1.006812 -2.903477 0.930267
C  1.897586 -1.660328 1.065383
C  -2.624699 -0.161196 0.458753
C  -1.200249 -0.016345 2.16715
C  -2.522861 1.175596 0.873775
C  -3.05624 2.212234 -0.011118
C  -4.076522 0.460527 -1.283608
H  -0.520429 -1.227477 -0.872435
H  1.252626 -2.846519 -1.253969
H  -2.143752 -2.995596 1.022416
H  1.510244 -3.792883 1.341917
H  2.163521 -1.502335 2.12487
H  1.419667 -0.756014 0.641052
H  -1.622011 -3.750555 -1.569769
H  0.745691 -5.106718 -0.980367
H  -0.480212 -0.337228 2.912286
H  -3.135018 -1.4738 -1.108576
H  4.993611 0.074044 2.39651
H  -5.128504 -0.90066 -2.501922
H  -5.384071 0.815697 -2.815769
H  2.543426 3.741578 -0.503256
H  5.440299 2.61446 -1.903739
H  -0.368642 2.304162 1.919559
H  -1.20375 3.650093 -0.598595
