program: Gaussian 09
title: 000036348
version: EM64L-G09RevD.01
frameworkgroup: C1[X(C17H16N4O)]
method: RPBEPBE
basis: SDD
operation: Freq
keyword: #p
keyword: freq=noraman
keyword: PBEPBE/SDD
title: #p freq=noraman PBEPBE/SDD
converged: YES YES NO NO
title: Mulliken charges:
elementType: O N N N N C C C C C C C C C C C C C C C C C H H H H H H H H H H H H H H H H
charge: -0.249164 -0.116555 -0.105009 -0.632321 -0.662404 0.160431 -0.023725 0.291322 0.321869 0.212873 -0.550724 -0.395326 -0.378094 -0.398825 -0.385982 -0.235549 -0.234991 -0.240288 -0.240469 -0.246595 -0.248224 0.230602 0.198286 0.245037 0.264324 0.262648 0.258003 0.265314 0.229517 0.227327 0.226548 0.224920 0.229417 0.227108 0.323123 0.294989 0.314423 0.336162
chargesum: 0.00000
title: Mulliken charges with hydrogens summed into heavy atoms:
elementType: O N N N N C C C C C C C C C C C C C C C C C
charge: -0.249164 -0.116555 -0.105009 -0.014209 -0.011818 0.160431 -0.023725 0.291322 0.321869 0.212873 -0.107402 -0.131002 -0.115445 -0.140822 -0.120668 -0.006032 -0.007664 -0.013740 -0.015549 -0.017179 -0.021117 0.230602
polarizability: 2.95535996e+02 -1.58159235e+01 2.75692548e+02 4.37986085e+00 2.11779226e+01 1.22888071e+02
1716.lowfreq: -2.8643 -0.0006 -0.0004 -0.0002 5.3116 5.6681 17.9033 20.7291 33.3526
frequency: 17.6756 20.5964 33.3045 45.1263 49.8274 79.6471 100.5725 120.5742 133.2170 185.8020 202.8403 233.0339 246.5694 258.6921 290.0502 348.4006 362.9059 380.2595 399.7956 401.7736 408.6041 413.6265 422.3147 471.0975 493.1393 525.8353 539.4237 568.8672 572.3163 614.4823 616.4297 651.3432 665.6654 677.7386 692.8455 697.6645 703.5349 706.6812 764.9999 774.2358 780.4266 851.0465 861.4030 873.2316 904.5557 926.8582 935.0137 939.5757 975.4035 979.3095 986.8469 987.7395 989.0620 995.7299 997.1869 998.9214 1002.1010 1028.6278 1034.1690 1035.6880 1077.0745 1082.6757 1123.1199 1162.6060 1172.0267 1173.6405 1174.9006 1190.0857 1195.1554 1200.6092 1274.8731 1319.3219 1323.9700 1346.7887 1358.2732 1377.3855 1379.7616 1411.4964 1435.0318 1438.4413 1441.0022 1467.8861 1495.6784 1549.9783 1573.8375 1584.0262 1587.1172 1600.8385 1613.2476 1615.2602 1617.4954 1667.4691 2874.3606 2984.7414 3123.7603 3126.4224 3134.1690 3136.7253 3149.1288 3152.0284 3159.3113 3161.8038 3169.2421 3170.3673 3523.8475 3552.4807 3672.1157 3700.3147
redmass: 4.2889 4.9838 3.7035 4.8557 4.5622 4.4473 4.6487 4.8297 6.6825 5.1586 4.7566 3.0816 4.5160 4.3509 5.5582 5.0792 3.9497 1.6623 1.4084 2.8069 2.9049 1.6921 1.2602 2.2972 3.6199 3.6479 3.7495 1.5621 3.2681 6.4177 6.4761 5.1204 6.8821 5.5019 7.0159 1.8634 3.4606 2.0856 2.9984 2.5518 2.1317 1.2501 1.2479 5.5083 7.5171 1.4626 1.4295 6.4252 2.5766 1.3853 1.3965 5.8226 5.8862 1.3696 2.4835 1.3109 7.0756 2.1868 1.4601 2.1438 1.7853 1.6812 3.3663 2.6342 1.0710 1.0798 2.0160 1.1343 1.1285 2.5097 1.7975 1.4249 1.3632 1.3874 3.2772 6.2043 7.6940 4.4284 2.3582 2.3387 1.0893 2.2145 2.7602 9.3735 6.7316 6.2303 7.2574 1.2372 1.2893 6.1290 5.9365 3.6432 1.0661 1.0895 1.0846 1.0848 1.0887 1.0888 1.0933 1.0933 1.0963 1.0956 1.0998 1.1005 1.0450 1.0456 1.1020 1.1026
irintensity: 1.4245 3.5378 0.3210 2.7967 0.9375 0.0756 0.0820 0.5350 0.7547 2.6293 4.4534 1.3900 1.0050 3.1599 0.2381 1.8566 0.8313 70.0849 166.2836 3.2697 0.5510 196.9543 22.8085 25.0717 1.5575 20.4637 9.3266 141.0913 64.6591 0.2360 0.1634 23.0121 12.0805 59.2219 10.7830 81.1916 12.1197 16.5785 62.2645 71.5405 18.6618 2.2299 0.2257 8.2372 8.0637 9.9451 1.8139 24.8662 0.4686 2.2587 0.4439 1.2428 0.8333 0.1161 23.4848 0.1255 36.7604 2.6826 9.4958 4.0894 14.3148 2.6237 2.5456 4.7991 0.0927 0.1621 7.0725 3.5124 0.1101 4.8158 1.4251 1.7227 0.6235 115.6067 8.6246 0.3696 1.6188 119.4083 13.1247 6.9018 15.0713 13.8804 22.2414 20.8317 1.3267 2.3219 0.3033 147.8099 67.9553 10.0731 17.4970 686.2931 59.9879 19.8881 1.2262 0.9957 10.1040 8.9694 47.9680 20.4982 13.2466 16.4469 22.7328 11.0315 24.2311 23.7598 20.2850 19.0105
temp: 298.150 k
press: 1.00000 atm
elementType: 8 7 7 7 7 6 6 6 6 6 6 6 6 6 6 6 6 6 6 6 6 6 1 1 1 1 1 1 1 1 1 1 1 1 1 1 1 1
symmnumber: 1
zpe: 782335.6 jmol-1
zpe.correction: 0.297976 hartree
zpe.thermalcorrener: 0.317418 hartree
zpe.thermalcorrenthalpy: 0.318363 hartree
zpe.thermalcorrgfe: 0.247210 hartree
zpe.sumelectzpe: -950.084897 hartree
zpe.sumelectthermal: -950.065455 hartree
zpe.sumelectthermalent: -950.064511 hartree
zpe.sumelectthermalfe: -950.135663 hartree
dipole: -3.5902 1.1051 -1.2290
dipole: 3.9524
quadrupole: -78.0928 -121.2563 -125.5665
quadrupole: 3.7274 4.3308 7.9034
quadrupole: 30.2124 -12.9511 -17.2613 3.7274 4.3308 7.9034
hfenergy: -950.3828732 hartree
pointgroup: C01 [X(C17H16N4O1)]
dipole: 1.3220479 -0.6888176 -0.4423616 debye
polarizability: 290.235661|-21.0593467|269.1803177|-12.0388927|-43.9837482|134.7006366 unknown
InChI: InChI=1S/C17H16N4O/c18-17(19)20-11-14-21-15(12-7-3-1-4-8-12)16(22-14)13-9-5-2-6-10-13/h1-10H,11,18-19H2
charge 0 multiplicity 1
38 atoms
O  1.176784 -0.666251 -0.27886
N  0.787963 1.549373 -0.62223
N  3.967489 0.288844 0.286726
N  5.895913 -0.706687 1.17303
N  5.954337 -0.06352 -1.082016
C  -0.219516 -0.448043 -0.08898
C  -0.446907 0.92058 -0.282959
C  -1.008644 -1.653066 0.181173
C  -1.658214 1.750428 -0.140525
C  1.709136 0.599324 -0.59935
C  3.175543 0.70152 -0.889212
C  -2.368024 -1.758657 -0.227853
C  -0.397459 -2.767641 0.823653
C  -2.730067 1.398488 0.725589
C  -1.734046 2.978072 -0.855138
C  -3.099007 -2.938218 0.021317
C  -1.133086 -3.945344 1.067514
C  -3.857102 2.238123 0.8489
C  -2.863365 3.813665 -0.732303
C  -2.488839 -4.036122 0.673411
C  -3.934361 3.446058 0.115997
C  5.203485 -0.1200 0.103819
H  3.398798 0.088831 -1.797408
H  3.351808 1.765199 -1.152313
H  -2.842803 -0.926417 -0.756946
H  0.652642 -2.697275 1.124265
H  -2.671762 0.482158 1.321921
H  -0.890857 3.263686 -1.491659
H  -4.14313 -3.004764 -0.30422
H  -0.649148 -4.792506 1.566223
H  -4.670391 1.955089 1.526801
H  -2.906974 4.753636 -1.294003
H  -3.059957 -4.951305 0.864731
H  -4.811323 4.095763 0.213677
H  5.343203 -0.829492 2.020339
H  6.893325 -0.52693 1.280723
H  6.718101 -0.717474 -1.238497
H  5.618857 0.480375 -1.871038
