program: Gaussian 09
title: 000036296
version: EM64L-G09RevD.01
frameworkgroup: C1[X(C10H8N2O2S2)]
method: RPBEPBE
basis: SDD
operation: Freq
keyword: #p
keyword: freq=noraman
keyword: PBEPBE/SDD
title: #p freq=noraman PBEPBE/SDD
converged: YES YES NO NO
title: Mulliken charges:
elementType: S S O O N N C C C C C C C C C C H H H H H H H H
charge: 0.337228 0.427282 -0.408841 -0.212583 -0.000250 -0.433199 0.306810 0.137472 -0.362191 -0.332884 -0.226295 -0.223826 -0.571672 -0.229577 -0.691100 0.227872 0.260374 0.271362 0.229679 0.231158 0.231585 0.320494 0.320498 0.390603
chargesum: 0.00000
title: Mulliken charges with hydrogens summed into heavy atoms:
elementType: S S O O N N C C C C C C C C C C
charge: 0.337228 0.427282 -0.018237 -0.212583 -0.000250 -0.433199 0.306810 0.137472 -0.101817 -0.061522 0.003385 0.007332 -0.571672 0.002007 -0.050108 0.227872
polarizability: 2.47368382e+02 -1.65220058e+01 1.92709112e+02 5.40842637e-02 4.67075474e-02 6.36190188e+01
1716.lowfreq: -4.5471 -0.0023 -0.0014 -0.0009 3.3972 5.5498 26.5886 29.7788 47.3610
frequency: 26.5772 29.7780 47.3540 48.9598 77.1426 92.6669 124.3384 172.5739 205.0409 236.7812 258.5442 297.8317 361.3744 393.3153 404.2890 468.1916 492.3825 501.1558 535.0639 560.9812 605.2647 613.3751 619.2479 632.7883 692.0842 700.0631 701.9267 743.3333 786.6964 851.8274 863.3905 873.1202 902.2055 936.9871 947.6431 989.6381 993.6964 1006.0827 1020.6856 1052.0023 1071.9028 1085.5800 1141.8996 1173.5126 1184.5560 1231.7757 1264.9942 1320.4543 1329.5045 1381.7590 1396.0015 1412.5723 1423.5541 1444.6121 1495.5043 1587.6641 1614.2763 1670.7906 3052.5773 3120.6785 3129.2354 3140.7697 3155.0679 3165.6292 3173.2847 3518.5616
redmass: 5.8117 7.8915 7.0284 5.4146 3.5209 5.9140 6.9845 8.6092 9.9750 11.5626 7.1510 9.6005 9.2611 10.7806 2.8431 4.1012 11.5647 1.7950 8.4248 5.3229 10.4825 7.5968 8.7700 1.3550 6.4890 8.5487 1.6892 7.0919 2.0079 10.1693 1.2456 5.0236 1.7750 11.2717 1.4223 6.2541 1.3811 1.3268 2.6980 2.1967 2.2798 2.1237 1.1311 1.0552 1.1142 1.3344 4.8017 1.4478 2.2166 7.4645 4.2832 1.1516 6.1561 2.6220 2.9790 6.3144 6.0840 9.0076 1.0583 1.1046 1.0852 1.0891 1.0936 1.0957 1.1003 1.0642
irintensity: 0.4365 0.9392 0.6372 0.8188 0.7978 3.6457 3.6859 1.4384 0.0886 0.1675 2.2814 0.4150 3.9897 9.5563 0.0169 0.6220 8.4696 29.8637 10.0920 58.4895 2.9154 5.7620 9.2353 142.9325 10.0689 1.2637 70.8053 26.0844 39.7841 9.9219 0.0005 11.1083 9.4790 105.4537 5.3823 0.1588 0.0007 0.4936 19.1742 301.9478 13.8600 5.0943 0.0501 0.0317 15.0374 0.8987 66.3442 24.6512 56.6543 41.9686 54.1395 20.8454 224.4635 36.1205 0.7703 1.3192 0.8433 198.3325 8.7313 0.0240 0.0433 12.4674 22.1611 12.9131 16.5728 37.2807
temp: 298.150 k
press: 1.00000 atm
elementType: 16 16 8 8 7 7 6 6 6 6 6 6 6 6 6 6 1 1 1 1 1 1 1 1
symmnumber: 1
zpe: 427982.7 jmol-1
zpe.correction: 0.163010 hartree
zpe.thermalcorrener: 0.177953 hartree
zpe.thermalcorrenthalpy: 0.178898 hartree
zpe.thermalcorrgfe: 0.117504 hartree
zpe.sumelectzpe: -1440.782405 hartree
zpe.sumelectthermal: -1440.767462 hartree
zpe.sumelectthermalent: -1440.766517 hartree
zpe.sumelectthermalfe: -1440.827911 hartree
dipole: -0.0165 -3.5172 -0.0015
dipole: 3.5173
quadrupole: -99.6657 -99.1729 -109.7077
quadrupole: 6.6621 0.0332 0.0157
quadrupole: 3.1831 3.6759 -6.8590 6.6621 0.0332 0.0157
hfenergy: -1440.9454149 hartree
pointgroup: C01 [X(C10H8N2O2S2)]
dipole: 0.0262955 -1.3811403 -0.0816462 debye
dipolederiv: -0.3768471 0.1445863 0.0172568 0.2520521 -0.0258885 -0.0087936 0.0235342 -0.0064685 0.0320504 -0.3353357 -0.2466162 -0.0032624 0.0528033 -0.2536102 -0.0285376 0.0148645 -0.0220026 0.2052052 -0.4099546 0.2395838 0.0138522 0.3306108 -1.30345 -0.0580976 0.0190238 -0.0562309 -0.4296114 -0.9070495 -0.2159851 0.0005893 0.1134133 -0.7459594 -0.0285893 0.0197694 -0.0215822 -0.2978543 -1.3587479 -0.2764784 0.0097283 -0.3641876 -0.6524203 -0.0242156 0.004588 -0.0261045 -0.1174098 -0.1639656 0.4048916 0.0212754 -0.0440224 -0.3388594 -0.0015038 -0.0059232 -0.0111271 -0.2998497 -0.0858437 -0.0461034 -0.0004576 -0.0493074 -0.0668323 -0.0044564 -0.0003389 -0.0042198 0.0252873 1.0732267 0.3864948 0.0025729 0.3503106 0.4276128 0.0119342 0.0004977 0.010917 0.1076672 -0.0119049 -0.0756355 -0.0065117 0.069957 -0.0317524 0.0045359 0.0020283 0.0074721 -0.1348623 -0.0340915 0.0786552 0.0028369 -0.0885464 0.0336392 0.0108231 -0.0070563 0.0075887 -0.124024 -0.1789977 -0.0556539 -0.0027235 -0.0156761 0.1693681 0.0190364 -0.0005852 0.0198207 -0.1549343 0.1361585 -0.0956718 -0.0111237 -0.1563803 -0.149508 0.0032824 -0.0146892 0.0020562 -0.1532423 1.332152 -0.2199305 -0.0439797 -0.095501 0.7073458 0.051878 -0.0367763 0.0544028 -0.1278781 0.0215722 0.033963 -0.0013314 0.0438612 0.0410384 0.0102606 -0.000728 0.0103586 -0.149331 -0.4807186 0.0599165 0.0160097 -0.2876758 0.2486306 0.0142813 -0.004597 0.0068506 0.1149359 1.4242868 -0.1327845 -0.0337414 -0.2523976 1.6019232 0.0856958 -0.0402235 0.0830688 0.2254251 -0.0115959 0.0687592 0.0069005 0.0859856 0.1065304 -0.0041685 0.00786 -0.0038486 0.1492133 0.1566375 0.0118793 0.0005928 0.0368533 -0.0159214 -0.0105227 0.0023103 -0.0100093 0.1544739 0.0709734 0.0364885 0.0037756 -0.0020003 -0.1252214 -0.0162552 0.0015352 -0.0170138 0.1569488 -0.1205314 0.046746 0.0080973 0.0694285 0.0608371 -0.0069281 0.009381 -0.0064631 0.1571722 -0.0513411 -0.1125668 -0.0024087 -0.1173033 0.002803 -0.0068083 -0.0026655 -0.0069179 0.1597409 0.1046268 -0.0172816 -0.0406449 0.060918 -0.0120898 -0.0517009 -0.0455003 -0.021377 0.0457567 0.1082979 -0.0211965 0.0360139 0.0571347 -0.0197823 0.0415501 0.0502088 0.014566 0.0498287 0.0989937 0.0039401 0.0066836 -0.0503299 0.3415665 -0.0027001 0.0034823 -0.0037362 0.4052918 unknown
polarizability: 246.8071025|17.4845399|192.7894819|-2.7434728|7.2269929|64.0999285 unknown
InChI: InChI=1S/C10H8N2O2S2/c13-8(14)6-15-10-11-9(12-16-10)7-4-2-1-3-5-7/h1-5,13H,6H2
charge 0 multiplicity 1
24 atoms
S  2.946298 1.305547 0.04248
S  0.366341 3.127606 0.205159
O  4.507046 -2.417991 -0.21002
O  5.464027 -0.297663 -0.107151
N  0.285461 0.485698 0.05006
N  -1.241146 2.315201 0.190488
C  -2.182239 0.047037 0.075505
C  -1.036756 0.978997 0.10695
C  -1.955994 -1.352473 -0.009413
C  -3.513468 0.541925 0.129838
C  -3.048511 -2.244701 -0.039857
C  -4.599748 -0.354516 0.099211
C  1.163585 1.475623 0.090335
C  -4.372444 -1.750008 0.014198
C  3.00247 -0.581392 -0.070931
C  4.450012 -1.023411 -0.127605
H  -0.926269 -1.720268 -0.049944
H  -3.674713 1.62246 0.195283
H  -2.868283 -3.323287 -0.105495
H  -5.624094 0.031506 0.141299
H  -5.220008 -2.444011 -0.009554
H  2.455056 -0.90464 -0.970167
H  2.491964 -1.009753 0.805801
H  5.457715 -2.712384 -0.246969
