program: Gaussian 09
title: 000000694
version: EM64L-G09RevD.01
frameworkgroup: C1[X(C6H6N2O)]
method: RPBEPBE
basis: SDD
operation: Freq
keyword: #pfreq=noraman
keyword: PBEPBE/SDD
title: #p freq=noraman PBEPBE/SDD
converged: NO YES YES YES
title: Mulliken charges:
elementType: O N N C C C C C C H H H H H H
charge: -0.412207 -0.003552 -0.057799 0.403086 -0.298756 -0.426128 -0.178326 -0.325303 -0.305402 0.239558 0.274876 0.234492 0.236280 0.244823 0.374358
chargesum: 0.00000
title: Mulliken charges with hydrogens summed into heavy atoms:
elementType: O N N C C C C C C
charge: -0.037849 -0.003552 -0.057799 0.403086 -0.059198 -0.151253 0.056166 -0.080481 -0.069122
polarizability: 1.46429340e+02 -6.71630163e+00 7.93058629e+01 1.39781339e-05 -1.88580447e-03 3.18708092e+01
1716.lowfreq: -10.7189 -5.5853 -0.0005 0.0006 0.0008 8.8506 87.8715 141.6130 142.0037
frequency: 87.8625 141.6067 142.0033 279.2965 360.4123 397.6968 419.4499 442.8966 509.0490 608.3286 653.0421 716.4997 813.1779 845.2403 912.7799 924.2959 939.0257 956.8744 987.5419 1001.7434 1027.9611 1118.2809 1198.3287 1215.1372 1228.9071 1310.0805 1333.5909 1387.6153 1412.9843 1458.6670 1540.2872 1584.0405 1588.0233 3058.0568 3128.9744 3138.7245 3149.5210 3168.6350 3566.1912
redmass: 3.3172 5.2966 5.9340 3.5400 8.4769 3.2125 4.8562 1.1333 3.7603 7.8019 6.4278 1.8548 1.6370 5.2462 9.4530 1.3628 1.3749 1.6012 1.4024 3.6328 3.0659 1.5948 1.3605 1.5676 1.3323 7.9915 1.2683 1.5652 2.1734 2.4062 5.2572 5.8272 6.0426 1.0897 1.0886 1.0909 1.0925 1.1001 1.0675
irintensity: 0.5164 0.0956 0.0185 0.0393 3.1507 1.5564 5.3873 181.0092 0.1991 4.4989 29.0812 41.5140 32.5465 44.8481 153.9919 4.5963 4.7008 21.2920 2.6112 5.5037 1.1547 7.6834 4.8058 88.1154 2.7137 0.0647 2.0824 15.9098 16.6697 26.9427 5.5087 1.4688 5.6804 15.9289 4.3367 16.7740 5.9813 25.0770 90.1292
temp: 298.150 k
press: 1.00000 atm
elementType: 8 7 7 6 6 6 6 6 6 1 1 1 1 1 1
symmnumber: 1
zpe: 291606.7 jmol-1
zpe.correction: 0.111067 hartree
zpe.thermalcorrener: 0.118817 hartree
zpe.thermalcorrenthalpy: 0.119762 hartree
zpe.thermalcorrgfe: 0.078411 hartree
zpe.sumelectzpe: -416.251938 hartree
zpe.sumelectthermal: -416.244188 hartree
zpe.sumelectthermalent: -416.243244 hartree
zpe.sumelectthermalfe: -416.284594 hartree
dipole: 0.5230 2.3669 0.0002
dipole: 2.4240
quadrupole: -43.2657 -51.2868 -55.0219
quadrupole: -9.7940 0.0013 -0.0004
quadrupole: 6.5924 -1.4287 -5.1638 -9.7940 0.0013 -0.0004
hfenergy: -416.3630054 hartree
pointgroup: C01 [X(C6H6N2O1)]
dipole: -0.2160861 0.9288846 -0.0000879 debye
dipolederiv: -1.6032043 -0.0757013 -0.0000325 0.5611323 -0.0132166 0.0001036 0.0000324 0.0000905 -0.3895757 -0.3773752 -0.0112816 0.0000101 -0.0383562 -0.3057246 0.0000025 0.0000159 0.0000052 -0.2458921 1.001907 0.1415501 0.0000821 -0.4192903 -0.1683072 -0.0000117 0.0000578 -0.0000012 -0.1755894 0.2028733 0.0634867 0.0000061 -0.0236528 -0.2215133 -0.0000037 0.0000385 0.0000056 0.0680305 0.0148843 -0.0585275 -0.0000152 -0.0288976 0.1376665 0.000003 0.0000088 0.0000052 -0.1455301 0.0723839 -0.0044359 -0.0000264 0.1546275 0.2405143 -0.0000193 -0.0000191 -0.000006 -0.0564544 -0.0860452 0.1171901 0.0000027 0.2775673 -0.0473977 -0.0000084 0.0000023 -0.0000143 -0.1047684 0.2643942 0.0112853 -0.0000314 -0.126498 0.1388623 0.0000082 -0.0000294 -0.0000018 -0.0855138 0.1301102 -0.0909108 -0.0000225 -0.3676082 0.1707597 0.0000177 -0.0001413 0.0000079 -0.0452336 0.0660687 0.0899592 0.0000067 0.0621905 -0.0610754 -0.0000029 0.0000024 -0.0000072 0.1506145 0.0292163 -0.0696791 0.0000128 -0.0768589 0.0315723 0.0000083 0.000019 0.0000024 0.1327958 -0.0069182 -0.0954206 0.0000068 -0.1207229 -0.0186598 0.0000057 0.0000083 0.0000055 0.1628209 0.0172208 0.0048942 0.0000024 0.064468 -0.0882678 -0.0000353 0.0000082 -0.0000227 0.1921788 -0.1206921 0.0073752 0.0000164 0.0328677 0.0868647 -0.0000021 0.0000135 0.0000022 0.1446962 0.3951763 -0.029784 -0.0000182 0.0490314 0.1179225 -0.0000654 -0.0000171 -0.0000712 0.3974208 unknown
polarizability: 146.2723028|7.4582105|79.4628998|-0.0000069|0.0018858|31.8708092 unknown
InChI: InChI=1S/C6H6N2O/c9-8-5-6-2-1-3-7-4-6/h1-5,9H
charge 0 multiplicity 1
15 atoms
O  -3.770757 0.067529 -0.000107
N  1.774134 -1.353282 -0.000072
N  -2.418807 -0.477953 -0.00009
C  -0.101105 0.235269 0.00002
C  0.815969 1.321232 -0.000023
C  0.440695 -1.085465 0.000004
C  2.201459 1.056975 -0.000094
C  2.635424 -0.288002 -0.000124
C  -1.544071 0.506811 0.000096
H  0.444671 2.353007 0.0000
H  -0.232428 -1.949269 0.000064
H  2.93225 1.871477 -0.00013
H  -1.877964 1.558098 0.00021
H  3.702405 -0.537185 -0.000197
H  -4.337774 -0.746442 -0.000356
