program: Gaussian 09
title: 000036279
version: EM64L-G09RevD.01
frameworkgroup: C1[X(C16H16O4)]
method: RPBEPBE
basis: SDD
operation: Freq
keyword: #pfreq=noraman
keyword: PBEPBE/SDD
title: #p freq=noraman PBEPBE/SDD
converged: YES YES NO NO
title: Mulliken charges:
elementType: O O O O C C C C C C C C C C C C C C C C H H H H H H H H H H H H H H H H
charge: -0.286391 -0.258192 -0.265770 -0.244535 0.220995 0.159844 0.080886 0.144314 -0.495162 0.175317 0.328605 -0.343443 -0.303348 -0.348216 -0.359187 -0.268861 -0.210915 -0.520328 -0.530718 -0.536925 0.283591 0.246577 0.259904 0.245358 0.254923 0.232867 0.232470 0.202459 0.263534 0.228149 0.213390 0.278422 0.230742 0.220995 0.221432 0.247218
chargesum: 0.00000
title: Mulliken charges with hydrogens summed into heavy atoms:
elementType: O O O O C C C C C C C C C C C C C C C C
charge: -0.286391 -0.258192 -0.265770 -0.244535 0.220995 0.159844 0.080886 0.144314 -0.211570 0.175317 0.328605 -0.096866 -0.043444 -0.102858 -0.104265 -0.035994 0.021555 0.173814 0.191836 0.152720
polarizability: 2.43554086e+02 -5.13646756e+00 1.95296051e+02 4.60376623e+00 1.12178073e+01 1.48519736e+02
1716.lowfreq: -8.5437 -5.6549 0.0008 0.0010 0.0011 3.1794 27.0958 38.1733 55.9054
frequency: 27.0728 38.0751 55.9039 75.3324 90.2376 102.7782 107.1205 133.4523 153.2206 165.1619 190.9847 205.6905 215.1071 223.5747 238.3726 252.9221 262.8490 294.8908 330.6880 364.0858 404.6128 414.9692 434.3596 437.6393 481.3257 507.4818 526.7918 540.0347 568.4003 593.3839 637.0414 670.9839 688.9204 710.9007 747.3573 757.6856 765.9224 790.2069 821.4638 831.0667 869.5352 895.8824 925.4598 936.2018 955.4141 958.1100 978.8798 985.8258 1005.5637 1041.3908 1083.1806 1108.6146 1112.5328 1112.9455 1118.1696 1136.8584 1151.4367 1155.7550 1163.4054 1170.6946 1189.8287 1219.1867 1227.5942 1250.0024 1270.3732 1275.8278 1364.0350 1382.2774 1401.7502 1412.8469 1421.5206 1437.2447 1437.8864 1451.4901 1452.8687 1466.8605 1467.4055 1471.2522 1472.4764 1476.7302 1482.2110 1539.4691 1563.7708 1572.7617 1608.7713 1613.4753 2958.7066 2960.8387 2974.0867 3046.1428 3069.2973 3082.7409 3121.2280 3121.3341 3126.4917 3134.9603 3145.9281 3146.6692 3157.0785 3163.2958 3168.2967 3174.6401
redmass: 5.2752 4.8754 4.4332 3.4269 3.3622 3.6944 3.1338 4.6355 2.2241 1.6643 3.1746 2.3906 2.5732 2.3026 3.6910 1.6864 2.3118 2.7318 5.1508 6.2088 4.7990 4.5425 4.5956 5.1922 4.7676 5.0134 4.3128 3.7379 3.5411 4.9309 5.9465 5.6288 5.3265 4.5044 5.4816 3.4952 1.5195 2.9987 1.6739 6.5853 1.5009 1.6094 5.1946 1.4401 5.3953 1.4623 7.9126 1.3308 4.3595 2.2302 2.7453 1.2694 1.2703 1.2592 1.5984 1.5670 1.3377 1.3276 1.3990 1.0941 2.1523 4.1719 3.5509 1.6503 1.6722 3.2294 8.6841 7.2661 2.7241 1.8267 1.4251 1.3888 1.3311 1.0606 1.0809 1.4702 1.0618 1.3656 1.2635 1.7409 1.0591 6.0351 6.6530 8.0871 6.2589 6.8205 1.0331 1.0338 1.0332 1.1040 1.0994 1.0987 1.1038 1.1042 1.0992 1.0855 1.0878 1.0898 1.0915 1.0947 1.0959 1.1000
irintensity: 1.2806 0.5045 1.7801 1.9303 4.5903 4.0829 6.3000 7.1850 1.5297 2.0467 1.9304 4.9049 4.0951 0.7697 2.1914 4.6941 2.3318 3.4395 3.3368 1.9178 3.5224 11.8063 6.2163 0.7545 3.0721 5.6110 18.3992 6.1050 7.1878 16.2201 20.7267 20.8920 1.5720 0.0665 17.1420 8.6906 91.8889 11.5845 39.0833 5.3836 5.4754 24.1381 63.8456 4.3390 45.2244 1.8934 38.1749 1.1960 69.1119 8.8102 18.4312 3.3832 0.6560 0.0476 24.0522 12.4338 0.3053 4.6838 14.4544 7.5389 180.4966 42.2480 98.4540 23.1839 47.6385 322.7691 8.1333 17.1527 59.9659 15.4014 10.2922 6.9727 28.4419 5.1734 29.8192 5.7511 12.6304 116.8427 92.1759 71.7458 10.4413 183.6591 98.3888 43.4833 60.1768 8.9777 70.4593 94.2848 47.6491 46.8441 24.1342 28.6421 35.4511 14.4941 22.6803 2.1284 8.3268 10.5192 1.4001 15.2088 12.9908 16.6877
temp: 298.150 k
press: 1.00000 atm
elementType: 8 8 8 8 6 6 6 6 6 6 6 6 6 6 6 6 6 6 6 6 1 1 1 1 1 1 1 1 1 1 1 1 1 1 1 1
symmnumber: 1
zpe: 736933.0 jmol-1
zpe.correction: 0.280683 hartree
zpe.thermalcorrener: 0.300004 hartree
zpe.thermalcorrenthalpy: 0.300948 hartree
zpe.thermalcorrgfe: 0.232409 hartree
zpe.sumelectzpe: -918.688019 hartree
zpe.sumelectthermal: -918.668699 hartree
zpe.sumelectthermalent: -918.667754 hartree
zpe.sumelectthermalfe: -918.736294 hartree
dipole: -3.7958 -2.3109 1.0740
dipole: 4.5718
quadrupole: -96.2038 -111.6748 -113.5781
quadrupole: -1.7661 -1.8680 5.5412
quadrupole: 10.9485 -4.5226 -6.4259 -1.7661 -1.8680 5.5412
hfenergy: -918.9687023 hartree
pointgroup: C01 [X(C16H16O4)]
dipole: -1.5850072 0.8078514 0.2654342 debye
polarizability: 241.4859227|14.2334834|165.5268322|-1.4630069|24.6104513|180.3571188 unknown
InChI: InChI=1S/C16H16O4/c1-18-11-8-9-15(20-3)13(10-11)16(17)12-6-4-5-7-14(12)19-2/h4-10H,1-3H3
charge 0 multiplicity 1
36 atoms
O  -1.04745 -2.840927 -0.771437
O  3.344609 1.164116 -1.259446
O  -3.146996 2.089108 0.9994
O  1.10817 -1.007867 -1.650686
C  -0.738731 -0.449077 -0.204742
C  1.700647 0.150055 0.389694
C  0.725478 -0.463696 -0.565419
C  -1.582722 -1.581354 -0.430469
C  -1.313332 0.744951 0.292088
C  2.946467 0.755764 0.012199
C  -2.704136 0.841713 0.530688
C  -2.965208 -1.48099 -0.168049
C  1.463069 -0.063678 1.7848
C  -3.540101 -0.278924 0.300377
C  3.923606 1.038818 1.005098
C  2.425168 0.234397 2.761894
C  3.674234 0.774431 2.360916
C  -1.038823 -3.168879 -2.21416
C  2.382107 1.433899 -2.335664
C  -4.57768 2.235764 1.276353
H  -0.687842 1.620856 0.490789
H  -3.585944 -2.371857 -0.311341
H  0.513355 -0.520438 2.08141
H  -4.616339 -0.234951 0.491755
H  4.862344 1.492708 0.673416
H  2.21755 0.035783 3.817973
H  4.44245 1.005063 3.107224
H  -2.060802 -3.098923 -2.637916
H  -0.347664 -2.489941 -2.742588
H  -0.679258 -4.207577 -2.273378
H  1.469435 1.919062 -1.938286
H  2.105217 0.498764 -2.848168
H  2.90953 2.121948 -3.014355
H  -5.18327 2.080611 0.361979
H  -4.90983 1.533116 2.065512
H  -4.697208 3.270753 1.628241
