program: Gaussian 09
title: 000036274
version: EM64L-G09RevD.01
frameworkgroup: C1[X(C10H13ClN6)]
method: RPBEPBE
basis: SDD
operation: Freq
keyword: #p
keyword: freq=noraman
keyword: PBEPBE/SDD
title: #p freq=noraman PBEPBE/SDD
converged: YES YES NO NO
title: Mulliken charges:
elementType: Cl N N N N N N C C C C C C C C C C H H H H H H H H H H H H H
charge: -0.010434 -0.334530 -0.389099 -0.096112 -0.017259 -0.016746 -0.023302 -0.139060 -0.525680 -0.430422 0.098153 0.271785 0.109424 -0.735425 -0.681854 -0.302267 -0.140578 0.260416 0.239248 0.240641 0.256823 0.248441 0.334908 0.343838 0.240932 0.245644 0.230460 0.278203 0.222849 0.221008
chargesum: 0.00000
title: Mulliken charges with hydrogens summed into heavy atoms:
elementType: Cl N N N N N N C C C C C C C C C C
charge: -0.010434 0.000377 -0.045260 -0.096112 -0.017259 -0.016746 -0.023302 0.121356 -0.045792 0.074841 0.098153 0.271785 0.109424 -0.018390 0.040205 -0.302267 -0.140578
polarizability: 1.92125019e+02 6.75010276e+00 1.86496870e+02 1.58226705e+00 -5.83073099e-01 1.01202624e+02
1716.lowfreq: -4.6378 0.0016 0.0019 0.0026 4.9331 6.7884 33.1621 47.6421 61.1998
frequency: 33.1392 47.6225 61.1497 62.2727 81.1941 121.5642 147.8378 173.3040 175.8693 184.6681 199.8209 224.1171 227.5310 262.1953 290.1703 298.3812 337.0245 366.1675 404.2150 409.9038 453.9593 505.7739 532.3767 548.2213 586.0013 598.8207 646.4023 648.3856 692.4010 706.0210 711.0945 756.3284 792.8646 807.0694 829.8171 850.3143 888.9032 916.5029 927.4628 937.3339 975.2392 1005.2547 1019.8649 1057.7591 1064.4932 1071.8234 1102.0104 1157.7793 1161.4706 1169.9845 1195.7128 1198.5578 1209.4864 1241.4521 1243.1940 1345.0278 1365.1653 1371.6292 1375.3992 1395.0297 1435.3212 1451.0465 1462.3901 1468.2406 1474.6263 1479.5527 1493.6360 1505.6619 1530.3909 1581.2893 2187.5544 2995.0161 2998.7972 3093.9946 3099.1715 3099.9215 3105.9288 3116.9731 3124.0422 3127.3676 3203.3163 3231.0838 3542.4306 3551.4629
redmass: 5.4220 3.2456 4.8963 5.7008 3.4638 5.0556 8.0139 7.7631 3.8244 6.8300 5.1534 1.0641 4.4563 1.2036 4.7273 2.8253 3.7223 2.9510 4.6378 5.0608 6.9848 4.1270 1.2107 5.2706 4.7411 1.2185 6.0649 6.4511 5.2592 10.0880 4.3598 1.2630 10.5265 2.0819 1.6523 4.0204 6.8027 2.6700 3.0590 1.6154 2.4119 2.2033 1.3451 1.2646 1.3315 3.1381 1.3030 3.2419 1.4480 2.5421 2.5005 3.8808 4.0039 2.6390 2.1492 2.0274 2.1813 1.4647 1.7753 1.2474 1.0923 1.0643 1.3452 1.0925 1.0564 2.0125 1.0954 2.5239 9.5505 7.1015 12.6507 1.0357 1.0352 1.1014 1.1003 1.0577 1.0841 1.0997 1.0634 1.1003 1.1167 1.1155 1.0767 1.0773
irintensity: 2.6054 1.1985 2.3753 0.1556 0.3128 0.5978 0.4183 0.2439 1.3181 3.7296 2.4898 0.1951 2.0830 0.3795 16.2206 1.5500 2.5425 3.8419 1.0702 2.5731 0.3774 5.0981 94.9071 3.0115 9.4717 65.9834 4.2811 22.5124 9.0870 0.1110 10.8205 0.2339 34.8519 19.5967 13.9205 33.6633 16.6869 20.6886 4.1270 7.0849 10.0874 25.5674 1.0240 40.3377 7.3065 1.9569 0.6577 37.7383 8.1623 23.3950 61.6122 201.7239 43.9109 4.9178 17.8321 307.3069 50.8412 68.2920 81.5355 62.5053 6.1773 18.0943 37.0335 40.7579 17.4369 137.6816 4.2413 159.4840 1192.8926 363.1262 1.6143 11.9440 24.9415 12.0392 22.8300 12.7850 24.2714 16.7681 3.2198 5.1941 7.6077 15.6638 80.8986 59.3482
temp: 298.150 k
press: 1.00000 atm
elementType: 17 7 7 7 7 7 7 6 6 6 6 6 6 6 6 6 6 1 1 1 1 1 1 1 1 1 1 1 1 1
symmnumber: 1
zpe: 601301.4 jmol-1
zpe.correction: 0.229024 hartree
zpe.thermalcorrener: 0.246188 hartree
zpe.thermalcorrenthalpy: 0.247132 hartree
zpe.thermalcorrgfe: 0.183172 hartree
zpe.sumelectzpe: -1176.140904 hartree
zpe.sumelectthermal: -1176.123740 hartree
zpe.sumelectthermalent: -1176.122796 hartree
zpe.sumelectthermalfe: -1176.186755 hartree
dipole: 3.7504 -0.0197 2.8745
dipole: 4.7253
quadrupole: -118.3400 -88.2678 -110.0261
quadrupole: -14.5982 8.3311 2.1355
quadrupole: -12.7954 17.2769 -4.4815 -14.5982 8.3311 2.1355
hfenergy: -1176.3699275 hartree
pointgroup: C01 [X(C10H13Cl1N6)]
dipole: 1.0946991 0.8815162 1.2168499 debye
polarizability: 182.9400327|3.9094225|195.1692854|5.6622568|4.0691129|101.7151941 unknown
InChI: InChI=1S/C10H13ClN6/c1-10(2,5-12)17-9-15-7(11)14-8(16-9)13-6-3-4-6/h6,13,17H,3-4H2,1-2H3
charge 0 multiplicity 1
30 atoms
Cl -2.49193 -3.859958 -0.491061
N  -2.359461 1.086247 0.376827
N  1.743386 -1.238169 0.125877
N  -0.262265 -0.005271 0.330147
N  -2.359469 -1.213435 -0.022334
N  -0.253887 -2.403433 -0.154627
N  2.207773 1.847909 -1.481115
C  -1.798863 2.394414 0.638049
C  -2.444964 3.59982 -0.055908
C  -1.044585 3.129784 -0.475179
C  -1.627767 -0.057236 0.228298
C  2.651577 -0.085698 0.333827
C  0.371234 -1.192551 0.107682
C  4.101963 -0.601881 0.121141
C  2.490871 0.518408 1.757549
C  -1.597309 -2.306985 -0.184772
C  2.378134 0.979799 -0.681345
H  -1.43058 2.536301 1.660485
H  -2.544886 4.524343 0.518899
H  -3.268951 3.403698 -0.749575
H  -0.938384 2.611867 -1.431052
H  -0.173218 3.722525 -0.187694
H  -3.373521 0.962745 0.331608
H  2.149204 -2.148868 -0.099987
H  4.234267 -1.018683 -0.892604
H  4.820244 0.22273 0.252277
H  4.328166 -1.38266 0.869413
H  1.456252 0.862752 1.904285
H  3.180331 1.370357 1.888841
H  2.730238 -0.25657 2.50645
