program: Gaussian 09
title: 000036271
version: EM64L-G09RevD.01
frameworkgroup: C1[X(C18H16ClNO2)]
method: RPBEPBE
basis: SDD
operation: Freq
keyword: #p
keyword: freq=noraman
keyword: PBEPBE/SDD
title: #p freq=noraman PBEPBE/SDD
converged: YES YES NO NO
title: Mulliken charges:
elementType: Cl O O N C C C C C C C C C C C C C C C C C C H H H H H H H H H H H H H H H H
charge: -0.061592 -0.296200 -0.296167 0.012543 0.274401 0.424187 -0.725088 0.390331 -0.547311 0.527197 -0.569537 0.209716 -0.553604 0.203496 -0.541858 -0.441387 -0.370510 -0.206272 -0.207512 -0.119240 -0.530100 -0.528549 0.237586 0.233251 0.273348 0.258811 0.253405 0.261566 0.240219 0.250471 0.255439 0.255252 0.232932 0.256137 0.230507 0.225746 0.233620 0.254767
chargesum: 0.00000
title: Mulliken charges with hydrogens summed into heavy atoms:
elementType: Cl O O N C C C C C C C C C C C C C C C C C C
charge: -0.061592 -0.296200 -0.296167 0.012543 0.274401 0.424187 -0.254251 0.390331 -0.273962 0.527197 -0.310727 0.209716 -0.300199 0.203496 -0.280292 -0.201168 -0.120039 0.049167 0.047740 -0.119240 0.189476 0.185583
polarizability: 2.48844374e+02 6.37341308e+00 2.57993135e+02 -1.06819834e+01 -1.17910656e+01 1.57557416e+02
1716.lowfreq: -6.9050 -1.7568 -0.0014 -0.0006 0.0007 3.2832 18.0083 25.0367 37.2361
frequency: 17.8785 24.9611 37.1199 66.5371 71.5704 96.6065 110.8548 130.3067 154.1935 163.0925 165.8021 191.6651 210.8951 224.5869 249.6461 281.3847 290.8003 318.5521 333.5418 350.9959 366.6523 404.6254 408.9094 424.2322 444.4661 480.3439 487.9713 537.1992 572.8967 585.2137 612.5702 628.1994 656.0524 665.2539 697.7670 711.8546 740.7124 743.0549 775.3440 794.9756 826.9069 832.3141 851.1980 875.3238 891.3542 910.1710 914.2409 931.5137 945.3290 951.5880 960.7753 969.6664 999.6728 1036.6805 1071.7122 1098.5412 1105.5701 1113.0573 1116.6030 1119.5122 1150.4161 1158.2049 1180.4887 1184.5808 1195.9849 1204.4150 1233.1079 1263.1380 1270.1523 1287.6849 1310.1647 1325.0484 1366.7434 1376.3444 1393.1948 1397.3891 1405.2891 1426.2316 1436.6437 1453.7019 1459.6130 1462.0156 1465.2050 1477.1309 1477.6075 1486.2694 1488.7886 1551.9864 1561.2846 1586.8955 1599.9069 1627.7082 2974.9285 2975.9232 2979.7214 3023.5520 3074.0555 3079.5362 3110.5992 3120.4416 3124.1677 3126.4227 3127.6729 3136.8956 3149.8228 3168.6159 3171.5838 3172.7451
redmass: 6.8399 4.3044 5.0029 3.9839 4.8514 6.3262 2.9002 3.8655 1.1878 1.3605 2.2452 4.1243 5.2190 3.9103 4.2485 5.7119 5.3901 5.6452 3.6685 4.4444 5.7876 5.0719 2.9693 4.6075 5.3159 3.1961 3.4559 4.4532 5.9104 4.6262 6.1512 6.6885 5.1159 5.6083 5.3537 4.6953 3.7090 4.4115 2.8822 2.8703 1.6609 1.2655 4.3868 1.4818 1.7478 2.6450 2.3071 1.7377 1.5923 5.0126 1.6314 1.3859 4.3153 4.9744 2.7479 2.8975 1.6247 1.2595 1.2971 2.6923 1.3613 1.5062 1.2891 1.1506 1.8983 2.2260 1.3524 2.1527 2.5385 1.5649 1.7545 2.1230 4.7068 6.3962 2.0361 2.5780 2.9397 1.3164 1.4773 1.6509 1.0869 1.1012 1.4162 2.0055 1.0787 1.2235 2.8249 7.1531 6.3568 7.3255 6.1825 7.0941 1.0596 1.0311 1.0307 1.1000 1.1041 1.1040 1.0903 1.0929 1.0900 1.1029 1.1033 1.0895 1.0919 1.0949 1.0958 1.0913
irintensity: 0.5652 0.0780 0.1803 1.7218 0.3081 0.5331 8.9768 5.1680 0.6009 0.3302 1.1559 0.8138 1.7084 6.4513 3.4400 7.7440 3.6742 1.1476 0.3909 1.6466 1.5487 7.7043 0.3848 11.5428 4.4437 15.1458 5.9105 11.9741 10.2416 7.0128 9.5814 3.0517 4.7965 13.8036 1.1749 9.9845 4.0329 12.6009 3.8921 26.3212 42.3213 3.0981 8.0823 0.1698 13.9097 66.6752 8.4241 20.4431 14.0371 89.1374 0.5329 0.2690 43.0178 24.8492 42.9770 19.4731 23.5394 15.5866 14.2020 25.0222 3.5017 10.4233 12.0311 1.1466 39.2354 22.5964 15.4001 21.2249 165.2238 1.4898 1.1162 4.3138 12.4484 0.7918 10.4393 5.2945 4.9830 4.1787 20.2246 53.7058 21.8212 12.8690 25.9987 69.7064 6.8371 0.3320 147.9240 15.9256 6.9681 2.2226 4.5977 11.0749 26.2816 82.2638 59.2883 9.0797 24.9228 21.4596 26.4732 20.1878 10.4598 22.1698 19.8823 4.4666 4.9669 6.0260 1.0770 1.9800
temp: 298.150 k
press: 1.00000 atm
elementType: 17 8 8 7 6 6 6 6 6 6 6 6 6 6 6 6 6 6 6 6 6 6 1 1 1 1 1 1 1 1 1 1 1 1 1 1 1 1
symmnumber: 1
zpe: 768786.3 jmol-1
zpe.correction: 0.292815 hartree
zpe.thermalcorrener: 0.312856 hartree
zpe.thermalcorrenthalpy: 0.313800 hartree
zpe.thermalcorrgfe: 0.242175 hartree
zpe.sumelectzpe: -1359.185707 hartree
zpe.sumelectthermal: -1359.165666 hartree
zpe.sumelectthermalent: -1359.164722 hartree
zpe.sumelectthermalfe: -1359.236347 hartree
dipole: 1.9129 -2.5551 1.7840
dipole: 3.6565
quadrupole: -135.2516 -139.6511 -131.9255
quadrupole: -13.0173 -2.1458 1.2683
quadrupole: 0.3578 -4.0417 3.6839 -13.0173 -2.1458 1.2683
hfenergy: -1359.4785222 hartree
pointgroup: C01 [X(C18H16Cl1N1O2)]
dipole: -0.9516782 0.9300273 0.5467347 debye
polarizability: 246.2233187|5.2906882|261.8606595|10.1620978|-1.2785342|156.3109465 unknown
InChI: InChI=1S/C18H16ClNO2/c1-21-17-8-14-11-20-10-13(16(14)9-18(17)22-2)7-12-3-5-15(19)6-4-12/h3-6,8-11H,7H2,1-2H3
charge 0 multiplicity 1
38 atoms
Cl 5.195327 2.76096 -1.265787
O  -2.146617 2.390048 0.421695
O  -4.220931 0.952838 -1.03527
N  -0.528253 -3.884535 -0.138949
C  -0.745785 -1.071079 0.415431
C  0.384606 -1.832023 0.893171
C  1.498344 -1.197399 1.713743
C  -1.760109 -1.772333 -0.344104
C  -0.9119 0.332414 0.639859
C  2.385119 -0.20363 0.956936
C  -2.914896 -1.067584 -0.807906
C  -2.032575 1.009404 0.157766
C  0.429348 -3.199815 0.591209
C  -3.071449 0.292485 -0.549374
C  -1.581712 -3.17624 -0.584866
C  2.833173 0.98369 1.588391
C  2.812851 -0.4666 -0.369318
C  3.689256 1.891163 0.923862
C  3.667461 0.426971 -1.051819
C  4.093073 1.595421 -0.39116
C  -2.168463 3.258479 -0.782692
C  -5.105936 1.514602 0.015006
H  2.137936 -2.012837 2.10632
H  1.070599 -0.690896 2.601062
H  -0.149195 0.914245 1.164072
H  -3.701595 -1.594539 -1.358544
H  1.26777 -3.813379 0.942911
H  -2.336277 -3.728301 -1.160017
H  2.5152 1.208337 2.613948
H  2.471577 -1.374724 -0.878907
H  4.03036 2.805839 1.41707
H  3.994123 0.219377 -2.074915
H  -2.328097 4.278414 -0.402346
H  -2.983943 2.964782 -1.466968
H  -1.194833 3.197806 -1.303471
H  -5.53002 0.695882 0.626139
H  -5.910237 2.032471 -0.528553
H  -4.5548 2.221187 0.660675
