program: Gaussian 09
title: 000036405
version: EM64L-G09RevD.01
frameworkgroup: C1[X(C19H21NO2S)]
method: RPBEPBE
basis: SDD
operation: Freq
keyword: #p
keyword: freq=noraman
keyword: PBEPBE/SDD
title: #p freq=noraman PBEPBE/SDD
converged: YES YES NO NO
title: Mulliken charges:
elementType: S O O N C C C C C C C C C C C C C C C C C C C H H H H H H H H H H H H H H H H H H H H H
charge: 0.830870 -0.560842 -0.559253 -0.139050 -0.893556 0.140104 -0.248905 0.405953 0.373878 0.230249 -0.250708 -0.454726 -0.250648 -0.420182 -0.381481 -0.401544 -0.324482 -0.232427 -0.231190 -0.221053 -0.236269 -0.617381 -0.614945 0.381627 0.288671 0.243652 0.227177 0.195647 0.294877 0.248364 0.250275 0.246270 0.214011 0.197570 0.241128 0.234269 0.233122 0.232712 0.227204 0.200660 0.225175 0.217504 0.191034 0.266639
chargesum: 0.00000
title: Mulliken charges with hydrogens summed into heavy atoms:
elementType: S O O N C C C C C C C C C C C C C C C C C C C
charge: 0.830870 -0.560842 -0.559253 -0.139050 -0.223258 0.140104 -0.248905 0.405953 0.373878 0.230249 -0.007056 -0.031902 0.044229 -0.171818 -0.131206 -0.155274 0.087098 0.008700 0.003079 0.012069 -0.003556 0.035658 0.060232
polarizability: 2.56248449e+02 -8.45504816e+00 2.40918755e+02 6.71084477e+00 3.82610972e+00 2.31938427e+02
1716.lowfreq: -9.9775 -5.6396 0.0009 0.0013 0.0019 2.1953 21.3189 37.6412 53.8626
frequency: 20.6901 37.0741 53.8186 62.8526 75.3759 84.5048 90.6318 99.5796 133.7044 155.2468 179.2244 194.5941 203.8224 217.0701 227.3839 232.6881 259.7986 265.9455 282.4132 296.8956 329.6461 339.7772 362.3773 388.4949 392.5457 410.3769 416.9327 439.6998 445.1259 465.6713 509.6731 519.8153 561.1167 585.0918 597.5721 621.1312 648.8727 664.6662 695.6525 724.0268 745.6227 760.4560 768.6114 778.8729 790.4427 829.0351 860.6024 873.9092 877.5590 883.9141 891.5488 903.8727 941.8081 949.2859 958.7981 962.8741 991.5532 994.0050 997.6567 1005.9591 1031.1408 1033.5091 1037.3908 1047.8722 1070.1762 1089.7273 1095.9005 1114.9267 1139.7371 1153.5530 1160.1804 1170.2595 1175.2130 1175.6137 1210.5232 1226.7103 1240.1710 1258.6920 1272.4278 1281.1138 1287.8467 1303.2058 1322.6067 1348.5989 1360.5877 1366.0041 1371.7898 1417.5641 1422.2704 1434.6940 1441.5369 1451.9983 1454.6011 1460.3205 1464.8889 1468.4920 1474.1449 1475.8275 1477.2705 1487.3124 1561.9539 1574.9137 1599.0056 1602.2158 1680.0121 2846.3011 2876.3750 2879.0983 2898.7615 2979.5719 3023.5202 3030.3464 3038.1270 3055.7247 3077.9667 3087.6784 3094.0490 3096.5433 3126.8027 3132.0204 3133.6187 3142.9938 3146.9617 3152.6495 3165.3825 3168.6201
redmass: 5.2767 4.3543 4.9125 2.9323 4.5989 4.2022 4.3444 4.1431 4.9778 3.9218 3.4616 6.3773 6.5475 1.2139 5.8427 1.0779 5.7697 2.6572 4.3507 4.9433 4.5736 3.5842 3.3181 8.0156 1.9899 3.7295 2.1664 3.5560 3.4174 3.4316 4.2292 3.3360 5.4761 3.9106 4.9910 5.6797 5.9206 5.2322 4.7739 3.9115 3.0918 1.7551 1.5960 1.6870 14.8910 4.0459 1.8154 1.8932 1.4813 2.9432 1.7726 2.2246 2.0328 2.1921 1.4954 1.4000 1.3357 1.8951 2.3708 3.0902 1.6678 2.0793 2.1314 2.6531 2.0843 1.3394 1.8185 1.6877 1.4213 1.4644 1.3226 1.0790 1.0622 1.9551 1.5107 2.0692 1.8961 2.0646 1.8691 1.5476 1.6136 1.1946 1.3488 1.5546 2.3451 1.9786 6.9416 2.2655 1.1431 2.2879 1.1482 2.5257 1.1057 1.0486 1.0944 1.0909 1.8937 1.2875 1.0630 1.0593 5.9805 6.4083 7.1844 6.3089 8.8563 1.0735 1.0603 1.0611 1.0587 1.0639 1.0762 1.0900 1.0785 1.0950 1.1007 1.0910 1.1005 1.0951 1.0855 1.0861 1.0895 1.0894 1.0945 1.0948 1.1008 1.1008
irintensity: 2.2632 1.2718 0.1350 0.3460 1.7098 0.6121 0.8781 0.5546 1.5632 0.8651 0.9431 4.7260 7.7953 0.5620 0.9677 0.4224 4.0000 2.7144 2.7018 6.1472 20.4363 12.5997 15.7779 26.3536 3.2187 4.9209 1.8035 17.1280 9.2031 16.8263 18.9975 1.7556 9.3676 6.9909 6.1426 2.8517 7.8050 4.1396 1.5958 7.3329 7.8740 35.5327 47.1353 53.4489 80.5983 7.0661 5.2151 14.7067 2.8051 52.9318 3.3282 24.9507 24.0972 18.6871 6.6018 3.7958 0.1273 1.5877 1.9716 6.2637 17.5853 2.8949 9.2950 13.0678 2.7486 4.6603 22.8875 5.6905 1.6486 2.9256 6.9043 1.5895 0.3902 2.2336 9.9204 2.6882 5.4439 4.5085 3.2926 6.4460 4.2701 12.7526 0.3204 4.7314 2.4536 1.9305 2.0339 5.9911 5.3931 5.3407 5.7845 17.8920 5.7940 5.8234 7.7968 7.3192 34.0502 11.3138 13.8478 9.8531 1.0446 0.9095 1.9010 0.3153 5.6045 513.6930 45.2606 49.9662 140.9360 47.8440 30.5507 10.8451 25.4071 16.3495 24.1943 21.2149 21.7765 18.4933 0.9998 1.5932 3.4388 7.0324 19.0118 4.2267 30.6926 31.7159
temp: 298.150 k
press: 1.00000 atm
elementType: 16 8 8 7 6 6 6 6 6 6 6 6 6 6 6 6 6 6 6 6 6 6 6 1 1 1 1 1 1 1 1 1 1 1 1 1 1 1 1 1 1 1 1 1
symmnumber: 1
zpe: 924148.6 jmol-1
zpe.correction: 0.351990 hartree
zpe.thermalcorrener: 0.374116 hartree
zpe.thermalcorrenthalpy: 0.375060 hartree
zpe.thermalcorrgfe: 0.300664 hartree
zpe.sumelectzpe: -1338.013566 hartree
zpe.sumelectthermal: -1337.991440 hartree
zpe.sumelectthermalent: -1337.990496 hartree
zpe.sumelectthermalfe: -1338.064892 hartree
dipole: -2.5563 4.7320 4.5126
dipole: 7.0207
quadrupole: -126.1181 -148.4263 -141.7345
quadrupole: 3.0860 10.5219 -8.2164
quadrupole: 12.6415 -9.6666 -2.9749 3.0860 10.5219 -8.2164
hfenergy: -1338.3655557 hartree
pointgroup: C01 [X(C19H21N1O2S1)]
dipole: 1.412175 0.7158155 -2.2633761 debye
polarizability: 253.0668885|13.2028217|236.8798286|4.644265|-3.0996855|239.1589148 unknown
InChI: InChI=1S/C19H21NO2S/c1-20(2)13-7-11-17-16-9-4-3-8-15(16)14-23(21,22)19-12-6-5-10-18(17)19/h3-6,8-12H,7,13-14H2,1-2H3
charge 0 multiplicity 1
44 atoms
S  -1.002769 -0.681878 1.875491
O  -0.338596 -2.109845 2.335061
O  -2.112561 0.017572 2.858378
N  3.241177 -1.06629 1.097587
C  0.520392 0.565663 1.603792
C  0.26231 -0.50997 -1.106841
C  -1.882437 -0.959893 0.201036
C  0.37372 1.496888 0.451553
C  -1.158845 -0.991743 -1.014035
C  0.395758 0.975567 -0.879934
C  1.287705 -1.362669 -1.375083
C  2.761515 -1.034159 -1.396372
C  -3.249442 -1.263931 0.306668
C  0.312878 2.899521 0.651864
C  -1.880563 -1.394703 -2.169104
C  0.40135 1.872464 -1.972858
C  3.499219 -1.724144 -0.209326
C  -3.942031 -1.655067 -0.861553
C  0.315866 3.785902 -0.447307
C  -3.249675 -1.736616 -2.091915
C  0.37548 3.271317 -1.762328
C  4.126635 0.096758 1.324943
C  3.251021 -2.016398 2.236655
H  1.351383 -0.163181 1.462084
H  0.53816 1.063075 2.586646
H  1.036555 -2.426218 -1.510344
H  2.926785 0.057803 -1.364977
H  3.212735 -1.409575 -2.337872
H  -3.746156 -1.19193 1.280199
H  0.27683 3.292673 1.674454
H  -1.356928 -1.416318 -3.131196
H  0.411415 1.470718 -2.99223
H  3.153578 -2.772517 -0.140726
H  4.594029 -1.759684 -0.431049
H  -5.00775 -1.900259 -0.807429
H  0.27206 4.867412 -0.279706
H  -3.78116 -2.049396 -2.997285
H  0.383309 3.95297 -2.619945
H  4.04065 0.81099 0.487024
H  5.202548 -0.189367 1.426911
H  3.82369 0.622562 2.248294
H  3.034076 -1.469918 3.171679
H  4.228992 -2.54097 2.361755
H  2.448991 -2.761519 2.10264
