program: Gaussian 09
title: 000036206
version: EM64L-G09RevD.01
frameworkgroup: C1[X(C13H10O3S)]
method: RPBEPBE
basis: SDD
operation: Freq
keyword: #p
keyword: freq=noraman
keyword: PBEPBE/SDD
title: #p freq=noraman PBEPBE/SDD
converged: YES YES NO NO
title: Mulliken charges:
elementType: S O O O C C C C C C C C C C C C C H H H H H H H H H H
charge: 0.696850 -0.609335 -0.430656 -0.270736 -0.272075 0.243751 -0.162427 -0.171163 -0.310342 -0.211369 -0.257704 -0.224287 -0.215492 -0.221502 -0.220172 0.113374 -0.224012 0.311779 0.281233 0.295871 0.289392 0.242547 0.239235 0.234199 0.232029 0.230659 0.390353
chargesum: 0.00000
title: Mulliken charges with hydrogens summed into heavy atoms:
elementType: S O O O C C C C C C C C C C C C C
charge: 0.696850 -0.609335 -0.040303 -0.270736 -0.272075 0.243751 -0.162427 0.140616 -0.029109 0.084502 0.031688 0.018260 0.023743 0.012697 0.011857 0.113374 0.006647
polarizability: 1.98059998e+02 -3.08069320e+00 1.86651946e+02 -5.98579262e+00 2.39335206e+00 1.16657376e+02
1716.lowfreq: -6.8257 -0.0022 -0.0013 0.0014 2.9179 6.9180 27.8605 41.8715 59.8181
frequency: 27.7746 41.8586 59.8125 113.8752 124.6890 135.7406 178.9225 193.4471 221.6502 234.5819 265.8929 314.3818 349.2438 405.1264 412.1085 426.9897 432.6188 474.0315 506.4807 517.0989 594.0059 598.3126 606.5208 633.2939 647.3513 687.3557 702.6823 753.4358 755.8828 764.2023 796.2899 801.1596 863.4260 915.7632 947.5934 975.2421 989.6749 992.3056 995.0684 1005.2256 1009.4606 1016.3605 1021.7375 1033.9416 1045.0185 1075.3455 1123.7437 1159.5974 1169.2096 1173.2808 1178.1850 1252.1196 1301.2912 1329.9586 1381.8934 1387.1843 1423.0060 1430.2466 1452.3037 1455.6821 1566.5664 1580.0831 1598.8682 1602.9758 1625.2758 3095.0245 3118.1362 3130.5171 3140.8179 3144.1996 3159.8777 3161.1901 3179.6484 3180.2611 3531.7750
redmass: 5.1313 6.1024 5.2602 6.6796 5.2508 8.6572 5.2375 6.8991 5.8695 6.5745 8.8372 8.9902 10.0332 4.5649 3.9489 3.6524 7.9501 3.7308 6.3773 4.0196 1.2393 5.0579 6.4024 6.7531 6.8115 4.0082 2.4432 2.4439 3.0867 1.6744 15.1074 1.8415 1.2403 1.3750 1.3652 5.6537 2.8433 1.6015 1.5481 1.4061 4.1135 1.3987 4.9587 1.9401 1.9668 1.5623 1.5484 1.5466 1.0759 1.1552 1.1205 1.5050 1.3080 2.7464 9.0476 6.8638 2.3337 2.1973 2.1751 2.4101 6.2807 5.8476 6.8082 6.8980 8.3596 1.0900 1.0879 1.0871 1.0884 1.0928 1.0945 1.0985 1.0960 1.0973 1.0643
irintensity: 0.1414 1.1873 0.0830 2.0379 0.1437 1.9782 0.0290 4.6246 5.6492 9.3535 1.6345 4.8507 8.9443 9.4396 2.8349 18.1993 6.7811 11.8479 7.3025 39.1637 103.9475 41.5139 2.0784 2.0735 1.3922 60.8947 47.2968 30.3643 21.2228 46.5700 53.3030 37.0804 0.2929 0.4597 8.3172 5.4315 44.7569 15.9007 6.0245 2.3790 7.9540 6.0592 195.3739 57.0411 14.0312 7.4339 35.5174 71.4055 3.9606 9.0268 9.9819 5.1245 1.4870 111.0326 2.2899 9.4327 16.3891 13.3796 53.6526 8.4444 2.9979 15.6496 0.3120 33.5786 276.2531 15.2495 7.5710 1.3584 2.3863 17.5398 21.5473 29.8427 16.0631 8.3469 63.7207
temp: 298.150 k
press: 1.00000 atm
elementType: 16 8 8 8 6 6 6 6 6 6 6 6 6 6 6 6 6 1 1 1 1 1 1 1 1 1 1
symmnumber: 1
zpe: 512575.3 jmol-1
zpe.correction: 0.195230 hartree
zpe.thermalcorrener: 0.210101 hartree
zpe.thermalcorrenthalpy: 0.211046 hartree
zpe.thermalcorrgfe: 0.152162 hartree
zpe.sumelectzpe: -1123.851085 hartree
zpe.sumelectthermal: -1123.836213 hartree
zpe.sumelectthermalent: -1123.835269 hartree
zpe.sumelectthermalfe: -1123.894152 hartree
dipole: 1.9800 2.4862 -4.0000
dipole: 5.1090
quadrupole: -91.3301 -94.6383 -110.9605
quadrupole: -1.3866 3.0121 8.0013
quadrupole: 7.6462 4.3380 -11.9842 -1.3866 3.0121 8.0013
hfenergy: -1124.0463145 hartree
pointgroup: C01 [X(C13H10O3S1)]
dipole: -0.686161 0.864252 1.6800299 debye
polarizability: 197.6902355|3.3669814|186.3431719|-8.8333322|3.6124932|117.3359128 unknown
InChI: InChI=1S/C13H10O3S/c14-13(15)11-8-4-5-9-12(11)17(16)10-6-2-1-3-7-10/h1-9,14H
charge 0 multiplicity 1
27 atoms
S  0.310583 -0.380206 -1.665387
O  0.599755 -1.976691 -2.07597
O  -2.604211 2.740233 0.335511
O  -0.720126 2.26733 -0.926641
C  -1.107047 -0.603777 -0.340444
C  -1.903671 0.445173 0.18556
C  1.754554 -0.021891 -0.436333
C  -1.353354 -1.945231 -0.023052
C  -2.958827 0.107624 1.079959
C  2.512078 -1.145756 -0.069472
C  2.076082 1.28653 -0.030537
C  -2.394718 -2.264265 0.878144
C  -3.195995 -1.236153 1.429345
C  3.626007 -0.956255 0.780028
C  3.198524 1.459548 0.815994
C  -1.660218 1.855992 -0.197205
C  3.966054 0.343656 1.224639
H  -0.729495 -2.707493 -0.512024
H  -3.579111 0.912832 1.482777
H  2.231182 -2.127198 -0.473284
H  1.478879 2.139132 -0.363438
H  -2.585035 -3.310818 1.13993
H  -4.008264 -1.483804 2.120582
H  4.230986 -1.817901 1.083102
H  3.473361 2.467195 1.147031
H  4.834546 0.487615 1.877213
H  -2.386021 3.663476 0.036574
