program: Gaussian 09
title: 000000696
version: EM64L-G09RevD.01
frameworkgroup: C1[X(C4H9O8P)]
method: RPBEPBE
basis: SDD
operation: Freq
keyword: #pfreq=noraman
keyword: PBEPBE/SDD
title: #p freq=noraman PBEPBE/SDD
converged: YES YES NO NO
title: Mulliken charges:
elementType: P O O O O O O O O C C C C H H H H H H H H H
charge: 1.368675 -0.511733 -0.452080 -0.562745 -0.397767 -0.662661 -0.696406 -0.232829 -0.597982 -0.049777 -0.118642 -0.335446 0.185453 0.241757 0.306335 0.229260 0.265200 0.359082 0.414211 0.399698 0.396197 0.452198
chargesum: 0.00000
title: Mulliken charges with hydrogens summed into heavy atoms:
elementType: P O O O O O O O O C C C C
charge: 1.368675 -0.511733 -0.092998 -0.148533 0.001931 -0.266464 -0.244208 -0.232829 -0.597982 0.191980 0.187692 0.159015 0.185453
polarizability: 1.17905003e+02 -1.57687127e+00 8.21538129e+01 3.62854606e+00 3.65121344e-01 8.12335353e+01
1716.lowfreq: -9.3208 -7.0193 -0.0011 0.0016 0.0018 9.2684 29.7871 58.8290 75.0246
frequency: 29.6195 58.8078 74.9398 85.7119 127.5864 140.9739 165.6805 185.9456 207.8276 219.9833 249.0833 263.0637 279.8747 312.2136 348.8201 357.1293 377.1427 401.9410 427.3917 447.4372 473.6192 551.6570 589.8978 629.4357 640.4054 697.6391 715.6310 790.2872 811.5161 858.5468 909.6253 960.8649 965.6647 1015.1526 1022.7043 1048.3879 1091.8275 1096.2269 1109.5736 1184.7256 1194.8512 1220.9544 1274.7392 1302.8953 1318.9520 1350.3066 1358.9751 1385.8606 1411.5960 1468.6302 1655.4899 2785.7922 3004.7242 3009.0100 3062.0633 3080.4552 3476.1456 3525.1833 3585.6815 3594.7780
redmass: 8.8835 8.6887 6.1218 10.6052 5.8639 6.9644 5.3078 3.0731 3.6334 1.2157 1.9813 8.8604 4.5080 3.3833 4.1074 8.5579 5.0198 1.3264 6.1713 4.8516 4.3781 2.1197 3.6760 7.3114 1.9660 3.7192 11.2923 5.6997 4.6462 1.1512 3.2139 7.2625 2.2691 1.5559 3.9614 2.8412 2.2830 3.4213 2.8634 1.2189 1.1630 1.1825 1.4788 1.2145 1.4193 1.3843 1.3297 1.4195 1.3823 1.0773 9.1321 1.0743 1.0850 1.0568 1.0855 1.1087 1.0653 1.0644 1.0668 1.0661
irintensity: 2.0241 0.8734 3.8169 3.1799 7.0442 4.5654 16.7918 55.0597 10.1367 107.0871 91.8794 10.4529 24.2102 45.0976 35.5096 13.3946 19.6019 168.6389 6.6829 7.9025 48.9515 64.9236 29.3582 11.3674 151.2754 14.5549 255.6774 107.1643 19.9426 235.8512 19.0788 207.7546 23.5995 9.1743 60.6925 223.3896 75.1336 210.7994 4.6250 20.8135 46.2102 1.4371 14.9078 0.3853 47.0775 39.3411 122.2450 7.9408 78.8637 13.4724 210.4539 1535.3941 17.8669 32.4652 5.5017 10.5989 102.3322 49.3184 19.5367 72.3366
temp: 298.150 k
press: 1.00000 atm
elementType: 15 8 8 8 8 8 8 8 8 6 6 6 6 1 1 1 1 1 1 1 1 1
symmnumber: 1
zpe: 394717.7 jmol-1
zpe.correction: 0.150340 hartree
zpe.thermalcorrener: 0.165505 hartree
zpe.thermalcorrenthalpy: 0.166449 hartree
zpe.thermalcorrgfe: 0.107698 hartree
zpe.sumelectzpe: -1099.777339 hartree
zpe.sumelectthermal: -1099.762174 hartree
zpe.sumelectthermalent: -1099.761230 hartree
zpe.sumelectthermalfe: -1099.819980 hartree
dipole: -5.0195 4.3262 0.8607
dipole: 6.6823
quadrupole: -76.4371 -78.2277 -91.5339
quadrupole: 5.7441 -8.7627 1.8853
quadrupole: 5.6291 3.8385 -9.4676 5.7441 -8.7627 1.8853
hfenergy: -1099.9276788 hartree
pointgroup: C01 [X(C4H9O8P1)]
dipole: -2.0159812 -1.2987442 -1.0773776 debye
dipolederiv: 2.6581205 0.1885703 -0.0627039 0.0804888 1.7773039 0.0713696 0.1082143 0.2500431 1.6264476 -1.3195043 -0.4174077 -0.1526129 -0.5111942 -0.7904567 -0.1573726 -0.1261788 -0.1138689 -0.5593554 -0.8105247 -0.2147413 -0.0887412 -0.1471566 -0.6051948 0.1663971 -0.0113681 0.2093825 -0.2751201 -0.8185064 0.0723092 -0.121796 0.0840915 -0.5567752 -0.0749452 -0.1268044 -0.1087524 -0.6695739 -0.5876339 0.105917 -0.4524662 0.095379 -0.4355267 0.1345477 -0.4471002 0.1509475 -0.9379031 -0.9953152 0.254271 -0.1125997 0.422567 -0.7849888 -0.0572098 -0.141341 -0.0821334 -0.531493 -1.2564979 -0.0106016 0.2982818 -0.1001521 -0.6730335 -0.0266 0.2506414 -0.1043017 -0.8479142 -0.7435551 0.1369909 0.2479422 0.1094699 -0.3269959 -0.0273936 -0.0076572 -0.0161462 -0.9171058 -0.7629619 -0.0694216 0.0295174 -0.0346679 -0.6797132 -0.0009153 0.0075476 0.025513 -0.5780623 0.4442687 0.18045 0.0490228 0.040831 0.4617561 -0.1346974 -0.0786078 -0.0437701 0.2459044 -0.1328175 0.1423099 0.14604 0.0224836 0.2291373 0.0291302 0.3296086 -0.0082211 0.4898235 0.502308 0.1608257 -0.0103363 0.4124792 0.415773 0.1339294 -0.1512218 -0.0647563 0.1478631 1.2401767 -0.334376 -0.0001967 -0.2447502 0.3527427 -0.0669185 0.196416 -0.1086642 1.4607714 0.0143398 -0.0143544 -0.0336608 -0.0173631 0.0011126 0.0334389 -0.0411042 0.0601553 -0.1072571 0.125803 -0.0687939 0.0065807 -0.0377224 0.028958 0.0294175 -0.0427909 0.0266572 0.0204904 -0.0317146 -0.0178796 0.0109962 -0.0414099 -0.0967344 -0.1016212 0.0073683 -0.1218276 0.0180091 0.0375152 -0.0151419 -0.0068415 -0.0318164 0.0643291 0.016363 -0.0032572 0.0920702 -0.0229412 0.384549 0.0629694 0.0845044 0.0230437 0.1917665 -0.1114836 0.0688269 -0.1448409 0.1934025 0.331967 -0.0555389 0.1097551 -0.0723549 0.3787277 0.0026582 -0.028122 0.016415 0.359008 0.2028823 0.0295985 0.0855525 0.015136 0.3976424 -0.0116348 0.1352025 -0.0288168 0.2978733 0.2977626 -0.0849717 0.1029105 -0.0670939 0.2868904 0.0716594 0.0817185 0.0790064 0.3100821 1.2193389 -0.0309833 -0.1291485 -0.0002883 0.3632793 0.081881 0.0200096 0.0359092 0.2770508 unknown
polarizability: 118.0013684|2.1670696|81.5211146|-2.7181984|0.6333663|81.7698679 unknown
InChI: InChI=1S/C4H9O8P/c5-2(3(6)4(7)8)1-12-13(9,10)11/h2-3,5-7,9-10H,1H2
charge 0 multiplicity 1
22 atoms
P  2.839473 0.360788 0.05555
O  1.584836 -0.216314 -1.028824
O  -1.668864 -1.824116 -0.101113
O  -0.428935 0.439755 1.420008
O  -3.080831 0.983099 -1.022199
O  3.922946 -0.969918 0.213427
O  2.121307 0.309778 1.573392
O  -3.064909 0.850277 1.304681
O  3.49018 1.686463 -0.510042
C  -0.762046 -0.836567 -0.704211
C  -0.984394 0.483328 0.067718
C  0.69927 -1.322066 -0.606962
C  -2.476635 0.786373 0.202865
H  -1.029142 -0.640415 -1.762381
H  -0.478961 1.296508 -0.480595
H  0.87189 -2.162606 -1.303264
H  0.910679 -1.652573 0.426383
H  -1.69819 -2.644144 -0.653672
H  -1.169632 0.361879 2.080914
H  -4.054286 1.15575 -0.90853
H  4.789767 -0.819015 -0.243185
H  1.094075 0.440035 1.616142
