program: Gaussian 09
title: 000036291
version: EM64L-G09RevD.01
frameworkgroup: C1[X(C19H22N2O2)]
method: RPBEPBE
basis: SDD
operation: Freq
keyword: #p
keyword: freq=noraman
keyword: PBEPBE/SDD
title: #p freq=noraman PBEPBE/SDD
converged: YES YES NO NO
title: Mulliken charges:
elementType: O O N N C C C C C C C C C C C C C C C C C C C H H H H H H H H H H H H H H H H H H H H H H
charge: -0.232313 -0.289581 -0.111045 -0.004975 -0.402179 -0.324902 -0.329243 -0.303716 -0.671920 -0.669784 0.236652 0.173774 0.049841 -0.362837 -0.322677 0.254321 0.020371 -0.234431 -0.255205 -0.364854 -0.338090 -0.212256 -0.223543 0.228321 0.226090 0.204416 0.191860 0.207382 0.193832 0.225501 0.210420 0.212645 0.225266 0.207885 0.209047 0.223869 0.208289 0.253232 0.270435 0.228503 0.231091 0.250586 0.253292 0.228667 0.227962
chargesum: 0.00000
title: Mulliken charges with hydrogens summed into heavy atoms:
elementType: O O N N C C C C C C C C C C C C C C C C C C C
charge: -0.232313 -0.289581 -0.111045 -0.004975 0.052232 0.071375 0.071971 0.132205 -0.026123 -0.028579 0.236652 0.173774 0.049841 -0.109605 -0.052242 0.254321 0.020371 -0.005928 -0.024114 -0.114268 -0.084798 0.016411 0.004419
polarizability: 3.09646469e+02 -4.43075995e+01 3.08655664e+02 -2.17506017e+00 3.03350948e+00 1.30108113e+02
1716.lowfreq: -14.5132 -8.0678 -2.3388 -0.0006 -0.0005 -0.0003 8.7492 21.1091 28.0247
frequency: -8.6609 21.0547 28.0243 30.6708 59.9902 64.4175 69.4633 80.1521 112.5044 144.8311 148.3359 169.9553 188.9043 219.8491 235.1002 241.5254 251.4507 283.2527 289.8317 305.2776 328.4205 339.6935 392.9852 426.7294 436.3605 466.8974 471.7989 488.1352 534.4130 548.4990 554.0121 574.1323 590.9160 611.1854 664.3177 677.2158 739.0572 748.8182 750.8537 760.7631 762.6583 778.5367 792.4319 794.6874 804.5151 818.4266 825.1581 859.5206 863.1193 869.3292 915.8684 938.5419 941.9443 953.5534 960.9321 977.7166 984.4666 990.1274 1001.3964 1048.9809 1061.0942 1062.8708 1076.1959 1084.4684 1093.7050 1097.0677 1121.3081 1125.3799 1148.3227 1160.6729 1175.8563 1177.3541 1188.8551 1207.6395 1230.7705 1235.5871 1255.8569 1278.0275 1280.1738 1283.9213 1287.9062 1290.7768 1328.2701 1361.6887 1365.4787 1378.1638 1386.5347 1387.5606 1391.9354 1399.3083 1423.9063 1434.6829 1457.8459 1460.6067 1462.3238 1466.9374 1469.9283 1478.4613 1482.5665 1485.2843 1488.0680 1491.2425 1542.1485 1580.9083 1600.4986 1614.2613 1620.1099 2858.0021 2866.6372 2932.4633 2966.8800 2982.3917 2983.3937 3019.1206 3034.0262 3034.9032 3069.7707 3076.0356 3076.9420 3090.3247 3090.6519 3135.2883 3136.5546 3154.0420 3156.2708 3171.6070 3171.8693 3179.1678 3182.1103
redmass: 3.3782 4.6733 4.1839 4.2317 2.7656 4.6446 3.5173 2.2169 2.9940 3.0908 4.6809 2.1969 1.8808 1.5647 2.2605 5.2802 6.0062 1.8516 3.3550 2.7259 5.0399 3.5737 3.3963 3.0097 3.1192 2.9916 3.5221 3.7556 3.7190 7.4019 6.2809 3.7960 6.4758 7.1158 6.4526 5.7381 3.1099 2.6913 2.8154 1.5226 1.5831 3.8732 1.4275 1.1333 2.4049 2.0355 3.8887 1.4087 1.4673 7.0770 1.8762 1.3810 8.5051 1.3670 8.1189 1.3024 1.3291 2.2352 2.0407 2.2389 1.6631 2.6805 1.9052 2.1402 2.8968 1.9434 1.7210 1.9010 1.4695 1.3910 2.0508 1.1218 2.6069 2.2531 3.0303 1.7893 3.3240 1.4932 1.1471 1.5695 1.2363 1.2025 1.3350 1.3440 1.3871 3.3560 1.2420 1.2470 1.8139 4.2452 2.2325 3.1799 2.4882 1.1439 1.0545 1.1889 1.0715 1.2469 1.3327 1.0915 1.1348 1.0827 8.0022 7.1153 6.4573 7.8216 7.7027 1.0717 1.0712 1.0699 1.0561 1.0356 1.0356 1.0882 1.0935 1.0970 1.0961 1.0982 1.0980 1.1005 1.1004 1.0864 1.0861 1.0912 1.0909 1.0939 1.0956 1.0992 1.0979
irintensity: 0.0192 0.3634 0.1970 0.0104 0.1954 2.4028 1.0078 0.6467 1.3886 1.6426 0.1984 1.8533 1.4405 0.0689 0.5879 0.1882 0.1965 1.7873 0.3814 3.2175 0.0087 0.9406 7.1051 4.3890 2.4764 7.2949 7.5765 4.0652 1.0707 3.8669 0.6102 0.0016 7.5101 2.1003 6.2782 3.6584 9.6428 10.3696 43.4989 151.1398 0.3846 25.8312 8.7911 3.8459 30.0492 28.8869 2.1632 0.0021 0.0439 1.9001 0.3630 4.0800 116.3952 2.4559 52.5987 0.0001 0.1636 8.9641 10.5161 18.7337 30.1999 29.7719 16.1216 3.0835 12.2391 14.0392 6.8598 14.8177 11.8117 6.8572 11.0702 13.3841 16.6946 36.3478 214.8808 42.7692 50.2760 23.9195 0.8410 4.0291 17.8732 15.0242 3.8788 1.8069 6.7233 17.1525 19.0424 20.9769 17.0795 10.0565 47.8490 18.7671 22.7631 17.0869 9.7390 39.4961 10.1967 54.7285 24.5195 17.0435 7.9690 14.2352 69.4330 49.2781 23.2306 9.3726 31.8463 31.8452 158.4492 46.0784 54.0876 32.7748 30.4841 20.0218 22.6991 15.1940 28.4819 46.3351 80.9727 28.2166 53.9421 2.4906 3.5072 16.2720 19.4071 16.9782 13.3291 18.3572 11.6810
temp: 298.150 k
press: 1.00000 atm
elementType: 8 8 7 7 6 6 6 6 6 6 6 6 6 6 6 6 6 6 6 6 6 6 6 1 1 1 1 1 1 1 1 1 1 1 1 1 1 1 1 1 1 1 1 1 1
symmnumber: 1
zpe: 967675.4 jmol-1
zpe.correction: 0.368568 hartree
zpe.thermalcorrener: 0.389540 hartree
zpe.thermalcorrenthalpy: 0.390485 hartree
zpe.thermalcorrgfe: 0.316652 hartree
zpe.sumelectzpe: -995.455455 hartree
zpe.sumelectthermal: -995.434482 hartree
zpe.sumelectthermalent: -995.433538 hartree
zpe.sumelectthermalfe: -995.507371 hartree
dipole: -1.5203 0.0313 -0.3388
dipole: 1.5579
quadrupole: -117.1153 -120.0158 -140.6340
quadrupole: -0.9775 1.0333 0.2403
quadrupole: 8.8064 5.9059 -14.7123 -0.9775 1.0333 0.2403
hfenergy: -995.824023 hartree
pointgroup: C01 [X(C19H22N2O2)]
dipole: -0.6085735 -0.008118 -0.072498 debye
polarizability: 311.9860746|-39.1087707|296.2245294|-28.6104758|36.0224636|140.1996411 unknown
InChI: InChI=1S/C19H22N2O2/c1-3-21(4-2)13-14-22-17-11-7-5-9-15(17)19-20-16-10-6-8-12-18(16)23-19/h5-12H,3-4,13-14H2,1-2H3
charge 0 multiplicity 1
45 atoms
O  -0.918699 0.399844 0.28344
O  3.342904 0.840036 -0.187652
N  -4.194762 -1.374499 0.176876
N  1.614309 -0.719176 -0.268552
C  -2.721395 -1.194992 0.190287
C  -4.651808 -2.610816 0.864549
C  -4.78013 -1.198328 -1.180637
C  -2.384973 0.283284 0.426585
C  -4.552943 -2.511995 2.398528
C  -6.248923 -0.734089 -1.150287
C  -0.326078 1.643114 0.457467
C  1.098052 1.718741 0.291964
C  1.914083 0.55808 -0.05068
C  -1.060982 2.81197 0.784494
C  1.732208 2.981781 0.466923
C  3.901297 -0.407463 -0.517317
C  2.843031 -1.360121 -0.566275
C  -0.403537 4.047619 0.950677
C  0.998496 4.13679 0.792614
C  5.242141 -0.723043 -0.766567
C  3.121877 -2.707245 -0.879581
C  5.508304 -2.078436 -1.080495
C  4.468601 -3.050435 -1.135531
H  -2.236549 -1.531844 -0.753487
H  -2.273854 -1.791388 1.003654
H  -5.710102 -2.774782 0.591487
H  -4.08926 -3.509747 0.506176
H  -4.180215 -0.432326 -1.707579
H  -4.69048 -2.135422 -1.786262
H  -2.702461 0.5925 1.44131
H  -2.887986 0.929887 -0.321031
H  -3.510796 -2.362801 2.735282
H  -5.15454 -1.661183 2.763213
H  -4.92592 -3.440071 2.870808
H  -6.905905 -1.473585 -0.657937
H  -6.335171 0.217164 -0.596663
H  -6.627801 -0.583675 -2.17852
H  -2.145507 2.759317 0.911138
H  2.816574 3.035147 0.340062
H  -0.988927 4.938485 1.203876
H  1.512262 5.094383 0.921604
H  6.03579 0.027478 -0.722775
H  2.318834 -3.448481 -0.920432
H  6.53963 -2.385006 -1.285828
H  4.72251 -4.086874 -1.382424
