program: Gaussian 09
title: 000036234
version: EM64L-G09RevD.01
frameworkgroup: C1[X(C6H9ClN4O8)]
method: RPBEPBE
basis: SDD
operation: Freq
keyword: #p
keyword: freq=noraman
keyword: PBEPBE/SDD
title: #p freq=noraman PBEPBE/SDD
converged: YES YES NO NO
title: Mulliken charges:
elementType: Cl O O O O O O O O N N N N C C C C C C H H H H H H H H H
charge: 0.185429 -0.266161 -0.173919 -0.180502 -0.128457 -0.116476 -0.215450 -0.184411 -0.194690 0.008222 0.168634 0.196597 0.150420 -0.375104 -0.094811 -0.474246 0.300991 -0.222945 -0.668929 0.309817 0.275390 0.251171 0.291407 0.241820 0.232023 0.218832 0.229758 0.235591
chargesum: 0.00000
title: Mulliken charges with hydrogens summed into heavy atoms:
elementType: Cl O O O O O O O O N N N N C C C C C C
charge: 0.185429 -0.266161 -0.173919 -0.180502 -0.128457 -0.116476 -0.215450 -0.184411 -0.194690 0.008222 0.168634 0.196597 0.150420 0.210103 -0.094811 0.068331 0.300991 0.250898 0.015252
polarizability: 1.75426326e+02 -4.35486061e+00 1.18669004e+02 -1.22833086e+00 7.65883997e+00 1.22126274e+02
1716.lowfreq: -6.6840 -4.5052 -0.0015 -0.0009 -0.0004 7.4978 15.5570 20.5399 43.1392
frequency: 15.4340 20.4835 43.1129 47.8817 60.1115 63.5900 76.3413 90.7961 105.5914 132.7860 137.4546 150.7005 164.8916 181.5491 212.6656 230.6740 250.6812 264.7656 299.0738 318.0464 339.9038 361.9196 371.7736 394.7141 415.0336 503.8975 532.0082 555.3869 608.5160 626.0627 631.0562 671.8685 678.1826 699.6404 734.0530 742.4159 791.8465 799.2473 825.7889 833.6692 896.5528 941.6221 971.4316 1021.3504 1060.2666 1096.8600 1113.6449 1134.7869 1138.3239 1159.5325 1169.7227 1202.4839 1204.5568 1251.8148 1304.2661 1323.6833 1332.4060 1358.5389 1367.8087 1402.9941 1413.2350 1436.8468 1444.4127 1451.7681 1464.3430 1464.3677 1474.0143 1486.1208 1668.4211 2999.0218 3008.5283 3016.2742 3022.9379 3077.2005 3081.9517 3092.5621 3095.9387 3112.0155
redmass: 5.2243 10.3385 9.2374 3.6567 4.8916 6.1399 9.9897 14.3862 10.9777 6.1362 2.9688 9.4100 11.4510 9.1386 7.3928 10.1177 1.2747 7.0404 5.1177 5.3200 5.3571 5.6731 2.9453 4.0723 9.1540 10.0565 3.9220 5.8434 9.6675 6.3943 7.4886 8.3501 8.1327 6.7392 11.1639 12.6322 6.4642 1.1004 4.7146 7.6185 5.3174 2.4604 2.6992 2.3615 9.5061 3.2548 2.3207 2.1227 2.2625 9.7780 10.1237 8.5025 1.7270 1.1340 1.4593 1.9594 1.3927 1.3722 1.3309 1.2607 1.7806 2.2548 2.9228 1.5881 1.1497 4.3132 1.0639 1.0674 10.1712 1.0360 1.0612 1.0584 1.0604 1.1067 1.1001 1.1002 1.0985 1.1032
irintensity: 0.1021 1.0788 0.1728 0.0512 1.0655 2.9052 0.9119 0.5356 1.3372 1.1419 3.6582 4.2066 1.1114 4.7459 9.4021 2.1991 1.0988 0.6758 2.7864 12.0784 0.5170 4.3076 4.8469 6.5775 0.3347 11.1412 3.8666 7.3201 21.7881 8.7255 2.9688 0.3932 12.1975 26.2373 65.4535 36.9288 9.4850 5.4095 9.4284 9.9787 8.4058 9.5509 43.4581 88.2394 15.8444 43.6745 21.8382 207.8257 259.4269 61.1886 296.5029 38.3857 12.0853 0.1174 26.2381 15.2157 43.2557 1.2193 36.4851 31.0019 124.1209 60.4109 89.4783 185.1730 14.8557 67.2626 5.1127 14.2733 169.8129 17.6075 0.5029 13.7159 5.5238 3.8834 9.4218 1.3894 24.4033 38.5463
temp: 298.150 k
press: 1.00000 atm
elementType: 17 8 8 8 8 8 8 8 8 7 7 7 7 6 6 6 6 6 6 1 1 1 1 1 1 1 1 1
symmnumber: 1
zpe: 473997.7 jmol-1
zpe.correction: 0.180536 hartree
zpe.thermalcorrener: 0.200825 hartree
zpe.thermalcorrenthalpy: 0.201769 hartree
zpe.thermalcorrgfe: 0.127862 hartree
zpe.sumelectzpe: -1513.111076 hartree
zpe.sumelectthermal: -1513.090787 hartree
zpe.sumelectthermalent: -1513.089843 hartree
zpe.sumelectthermalfe: -1513.163750 hartree
dipole: 6.1086 -3.2929 -3.2745
dipole: 7.6733
quadrupole: -112.3171 -129.1792 -115.1072
quadrupole: -5.2088 1.8131 -3.8215
quadrupole: 6.5508 -10.3114 3.7606 -5.2088 1.8131 -3.8215
hfenergy: -1513.2916119 hartree
pointgroup: C01 [X(C6H9Cl1N4O8)]
dipole: -2.2551935 -1.5050826 1.3276879 debye
polarizability: 174.5991911|6.5666317|120.426726|-3.8789009|-8.2950781|121.1956872 unknown
InChI: InChI=1S/C6H9ClN4O8/c1-2-19-5(12)3-8(11(17)18)4-6(7,9(13)14)10(15)16/h2-4H2,1H3
charge 0 multiplicity 1
28 atoms
Cl 0.997479 -0.698591 -1.751177
O  -3.765957 -0.619839 0.521129
O  2.508201 -2.339828 0.998978
O  3.649782 1.181574 0.532756
O  3.908741 -1.672724 -0.674364
O  3.091087 1.364581 -1.678469
O  -2.247599 -0.375651 -1.237935
O  -1.574384 2.390533 0.326005
O  0.711898 2.470018 0.045172
N  -0.289597 0.519817 0.736809
N  2.8825 -1.547537 0.066218
N  2.978166 0.877422 -0.519594
N  -0.395868 1.880354 0.347112
C  1.052573 0.016477 0.995244
C  1.932315 -0.283375 -0.247117
C  -1.53049 -0.145659 1.141667
C  -2.515279 -0.373944 -0.021923
C  -4.872716 -0.890101 -0.458873
C  -6.137778 -1.122202 0.357652
H  1.627383 0.722178 1.624523
H  0.953464 -0.934651 1.544408
H  -1.262301 -1.127474 1.567884
H  -2.054309 0.434071 1.922264
H  -4.94873 -0.014475 -1.127443
H  -4.585264 -1.768386 -1.064337
H  -6.985355 -1.320773 -0.323035
H  -6.023894 -1.989255 1.030272
H  -6.383369 -0.23576 0.966375
