program: Gaussian 09
title: 000036217
version: EM64L-G09RevD.01
frameworkgroup: C1[X(C6H12N10)]
method: RPBEPBE
basis: SDD
operation: Freq
keyword: #pfreq=noraman
keyword: PBEPBE/SDD
title: #p freq=noraman PBEPBE/SDD
converged: YES YES NO NO
title: Mulliken charges:
elementType: N N N N N N N N N N C C C C C C H H H H H H H H H H H H
charge: -0.242279 -0.174165 -0.233809 -0.127460 -0.386158 -0.389447 -0.650373 -0.645965 -0.499433 -0.500053 0.194387 -0.013650 -0.308954 -0.253704 0.228596 0.244902 0.247956 0.238680 0.310649 0.309318 0.452092 0.286222 0.417287 0.289697 0.300905 0.301963 0.299143 0.303653
chargesum: 0.00000
title: Mulliken charges with hydrogens summed into heavy atoms:
elementType: N N N N N N N N N N C C C C C C
charge: -0.242279 -0.174165 -0.233809 -0.127460 -0.075510 -0.080128 0.087941 0.061019 0.103434 0.102744 0.194387 -0.013650 -0.060998 -0.015024 0.228596 0.244902
polarizability: 2.54550536e+02 5.39964510e+00 1.69593571e+02 2.37777329e-01 -5.37381962e-01 6.54887219e+01
1716.lowfreq: -3.1932 -0.0010 -0.0009 -0.0007 2.8713 7.2490 44.0809 45.0758 63.4353
frequency: 44.0656 45.0595 63.4095 83.4011 87.9886 106.1452 114.5341 160.7151 161.6661 164.7450 201.5631 238.1111 249.4449 275.7243 346.1406 393.1514 406.5168 412.9937 468.8160 469.3527 482.5496 501.3012 518.3634 540.4645 566.6680 679.0526 682.1112 695.2046 706.4212 713.5768 771.9822 791.3708 809.0237 826.4957 833.9618 901.6738 944.3853 945.3090 963.2418 992.8021 997.1025 1035.7662 1077.7731 1090.9467 1101.0077 1234.4814 1235.8637 1245.6753 1267.6194 1300.3264 1304.4745 1307.8007 1353.4015 1370.5339 1385.1133 1411.7127 1461.7070 1482.0174 1504.3768 1510.1072 1522.5052 1550.8068 1611.2155 1638.5279 1692.6231 1695.0971 2861.7979 2979.6681 3131.5134 3195.9898 3380.3818 3385.1392 3485.5427 3491.6528 3574.7537 3575.9679 3581.4460 3594.5569
redmass: 4.2009 3.2620 1.2906 5.3105 1.3537 2.9118 5.2158 3.8460 3.7206 3.9490 4.4440 5.3933 4.5280 6.4500 4.0573 1.2903 1.2124 3.4095 3.6340 3.2185 3.8689 1.3357 1.2571 4.4830 5.0042 6.7916 5.0827 6.4941 6.6775 5.5569 4.3632 6.0403 2.2388 1.6639 2.0086 3.6493 4.2125 1.2332 1.3564 5.2391 1.0862 2.8966 1.6114 1.6802 1.9833 3.1883 3.3678 7.7694 2.4934 1.1475 1.1552 1.9152 2.2200 1.5792 3.7733 2.6466 1.6972 1.4686 3.7409 3.5828 3.8571 4.4567 2.9099 2.5379 1.0602 1.0611 1.0775 1.0728 1.0912 1.0963 1.0433 1.0432 1.0972 1.0976 1.0791 1.0790 1.0826 1.0840
irintensity: 0.4906 9.2714 6.5894 3.1732 18.9518 4.0746 9.2697 4.2477 3.3598 9.6857 4.0624 1.6254 16.3528 6.3162 21.0495 11.7752 10.8496 20.5967 0.8814 4.2512 37.3694 256.3214 388.1667 16.4783 11.4131 29.6203 3.0553 1.7333 18.2299 3.7953 4.2991 12.5888 306.8655 54.0959 79.3679 37.3031 11.7984 88.6886 2.5770 3.4791 109.0904 7.3346 4.4400 9.5308 11.8961 65.3818 16.6421 14.7182 90.9062 0.3403 0.5411 2.2136 47.3441 75.9095 372.8557 587.5034 589.2815 190.4863 146.9253 278.7899 546.4006 1060.9936 774.0215 498.0940 26.8058 25.1994 572.9332 487.2346 28.9098 5.8233 0.7348 0.4562 1.3688 1.0812 63.6760 54.8265 33.8430 40.3232
temp: 298.150 k
press: 1.00000 atm
elementType: 7 7 7 7 7 7 7 7 7 7 6 6 6 6 6 6 1 1 1 1 1 1 1 1 1 1 1 1
symmnumber: 1
zpe: 568145.4 jmol-1
zpe.correction: 0.216395 hartree
zpe.thermalcorrener: 0.232863 hartree
zpe.thermalcorrenthalpy: 0.233807 hartree
zpe.thermalcorrgfe: 0.171587 hartree
zpe.sumelectzpe: -782.122464 hartree
zpe.sumelectthermal: -782.105996 hartree
zpe.sumelectthermalent: -782.105052 hartree
zpe.sumelectthermalfe: -782.167272 hartree
dipole: 1.3051 -0.6453 0.1623
dipole: 1.4649
quadrupole: -77.7317 -80.4975 -96.0391
quadrupole: 11.1096 0.2994 -0.4788
quadrupole: 7.0244 4.2586 -11.2830 11.1096 0.2994 -0.4788
hfenergy: -782.3388588 hartree
pointgroup: C01 [X(C6H12N10)]
dipole: -0.5225707 0.2389471 0.0447136 debye
polarizability: 252.1915518|4.0380045|167.1525032|20.608566|16.471848|70.288774 unknown
InChI: InChI=1S/C6H12N10/c7-4(15-9)12-3-1-2-11-6(13-3)14-5(8)16-10/h1-2,15-16H,7-10H2
charge 0 multiplicity 1
28 atoms
N  0.358893 0.227828 -0.221126
N  2.734446 -0.189866 -0.027393
N  -1.166576 -1.609478 -0.668833
N  -1.923129 0.679044 -0.406233
N  4.332047 1.454477 0.405919
N  -4.142245 1.37748 -0.521835
N  2.056601 2.108289 0.260162
N  -3.677403 -0.926701 -0.823461
N  5.392204 0.51603 0.358519
N  -3.777595 2.731417 -0.31155
C  1.440296 -0.635841 -0.23458
C  -0.908093 -0.261725 -0.434985
C  1.224736 -2.033824 -0.472183
C  -0.089938 -2.458388 -0.67989
C  2.996965 1.11316 0.206558
C  -3.211384 0.342008 -0.583904
H  2.073845 -2.718869 -0.485085
H  -0.316292 -3.514459 -0.865313
H  4.610591 2.424069 0.549201
H  -5.117005 1.222055 -0.774434
H  1.074276 1.737755 0.092554
H  2.295279 3.080496 0.45133
H  -2.897527 -1.636068 -0.853384
H  -4.668798 -1.145027 -0.90552
H  5.274817 -0.18161 1.108183
H  5.389979 0.032964 -0.552273
H  -3.422423 2.848184 0.649246
H  -3.031468 2.992804 -0.974391
