program: Gaussian 09
title: 000036230
version: EM64L-G09RevD.01
frameworkgroup: C1[X(C14H15NO3)]
method: RPBEPBE
basis: SDD
operation: Freq
keyword: #p
keyword: freq=noraman
keyword: PBEPBE/SDD
title: #p freq=noraman PBEPBE/SDD
converged: YES YES NO NO
title: Mulliken charges:
elementType: O O O N C C C C C C C C C C C C C C H H H H H H H H H H H H H H H
charge: -0.284557 -0.261955 -0.239660 -0.125332 -0.335717 -0.343827 0.143172 0.196299 0.192981 0.192554 -0.667078 -0.658271 -0.386544 0.140581 -0.353582 -0.351828 -0.243517 -0.206157 0.205792 0.257330 0.220230 0.238686 0.261639 0.205016 0.221073 0.244340 0.213785 0.216881 0.292460 0.282420 0.255773 0.238863 0.238151
chargesum: 0.00000
title: Mulliken charges with hydrogens summed into heavy atoms:
elementType: O O O N C C C C C C C C C C C C C C
charge: -0.284557 -0.261955 -0.239660 -0.125332 0.127405 0.115089 0.143172 0.196299 0.192981 0.192554 0.020650 0.016735 -0.094084 0.140581 -0.071163 -0.096055 -0.004654 0.031994
polarizability: 2.35206700e+02 1.31720334e+00 1.91878038e+02 6.90580741e+00 -4.21305975e+00 9.16312373e+01
1716.lowfreq: -7.2942 -0.0003 -0.0002 0.0006 6.0795 7.4590 23.6882 46.6743 57.7200
frequency: 23.2368 46.6499 57.7000 87.1293 100.0988 127.7888 147.6306 151.8344 169.2493 205.9663 217.3981 247.2565 267.2280 279.4703 306.4104 323.5538 374.8413 423.5800 434.3323 463.8359 488.3100 504.9055 519.8366 540.9011 576.4840 599.7004 650.2264 667.5541 714.0113 733.5053 759.8360 771.2300 782.2448 784.9064 815.1005 833.9165 883.2908 898.6935 909.3343 942.4182 973.2521 996.9327 1002.9204 1022.0724 1061.0459 1071.7750 1073.5710 1082.0915 1102.0780 1124.3617 1160.9750 1173.6018 1191.2990 1206.1050 1242.7546 1259.5553 1279.4163 1300.6703 1329.7898 1344.7490 1355.9388 1384.4379 1386.7275 1398.9363 1416.4685 1445.7184 1452.5512 1460.3203 1467.2601 1469.8923 1477.1472 1484.7659 1490.5990 1553.1406 1557.1939 1574.0181 1618.1375 1622.0454 2987.6901 2988.6907 2993.4686 3017.2731 3073.0468 3073.8982 3089.0285 3093.3834 3107.2716 3109.7053 3140.8674 3152.7062 3164.9714 3176.0735 3194.0795
redmass: 4.7026 4.2920 3.8852 3.0559 3.8719 4.5592 4.4491 3.5929 4.5956 1.1960 1.1907 2.6714 5.8044 6.9449 3.2720 2.9546 3.4177 3.3062 3.9068 4.3065 6.3461 8.0729 3.7197 6.1048 5.7388 4.8583 5.1139 3.3994 5.5924 7.4967 2.5412 1.4318 1.2438 1.4646 2.5697 5.1897 1.4020 1.7342 2.9572 2.1438 1.3682 2.9806 1.3330 2.1798 2.8792 3.0738 2.3120 1.8347 1.7938 1.6381 1.3560 2.1796 2.1745 2.7932 1.7648 1.5647 1.5787 1.3461 3.3538 1.2617 1.3022 1.2161 1.2175 9.4511 2.8789 2.6377 1.1356 2.6199 1.0455 1.0440 1.0981 1.0537 1.0764 8.7807 6.8258 7.2278 7.3053 7.7357 1.0363 1.0392 1.0654 1.0612 1.1001 1.0977 1.1000 1.0948 1.1021 1.1011 1.0861 1.0900 1.0953 1.1006 1.0924
irintensity: 0.3528 0.9308 0.2418 0.8269 0.2244 2.4808 1.2434 0.4423 6.7478 0.3160 0.1536 1.2887 0.7806 3.8626 0.5683 3.5011 21.4024 2.9224 7.7950 2.7634 6.9090 1.9042 4.4989 4.2745 2.1683 6.2047 6.2230 5.4369 1.0214 7.9379 32.7955 1.1689 24.3114 47.4993 26.7357 51.5659 1.1035 24.7621 18.0240 3.8585 2.3205 5.9443 0.2598 9.1482 32.2959 1.1409 9.8928 17.4190 19.1040 49.0521 2.2913 15.1120 27.2929 30.2142 2.8404 93.7617 23.7885 46.1768 155.4142 13.1631 12.1973 14.3457 28.7818 6.6094 77.1048 79.3832 27.1659 1.3401 3.8952 13.1548 12.2866 4.3194 21.2831 31.6660 369.4492 31.1501 70.0008 86.8093 22.4553 27.7694 39.9903 34.9855 13.9842 10.2028 36.0861 27.9636 9.5460 53.5275 2.9010 3.8415 10.0908 17.7162 2.4870
temp: 298.150 k
press: 1.00000 atm
elementType: 8 8 8 7 6 6 6 6 6 6 6 6 6 6 6 6 6 6 1 1 1 1 1 1 1 1 1 1 1 1 1 1 1
symmnumber: 1
zpe: 686704.7 jmol-1
zpe.correction: 0.261552 hartree
zpe.thermalcorrener: 0.278361 hartree
zpe.thermalcorrenthalpy: 0.279305 hartree
zpe.thermalcorrgfe: 0.216298 hartree
zpe.sumelectzpe: -821.602689 hartree
zpe.sumelectthermal: -821.585881 hartree
zpe.sumelectthermalent: -821.584937 hartree
zpe.sumelectthermalfe: -821.647943 hartree
dipole: -1.3548 7.0105 1.3848
dipole: 7.2733
quadrupole: -90.7088 -114.1923 -109.3317
quadrupole: 5.5073 -5.4693 -1.2566
quadrupole: 14.0355 -9.4480 -4.5875 5.5073 -5.4693 -1.2566
hfenergy: -821.8642414 hartree
pointgroup: C01 [X(C14H15N1O3)]
dipole: 0.357328 -2.4957719 1.3534152 debye
polarizability: 235.1913057|-3.3752863|185.5614795|-5.9726689|-24.8100452|97.9631899 unknown
InChI: InChI=1S/C14H15NO3/c1-3-15(4-2)14(17)13-9-11(16)10-7-5-6-8-12(10)18-13/h5-9H,3-4H2,1-2H3
charge 0 multiplicity 1
33 atoms
O  -0.159409 -0.476452 -0.091318
O  2.562066 1.366553 -1.406482
O  -2.182579 3.179436 -0.399333
N  2.740858 -0.351972 0.156306
C  4.189655 -0.457992 -0.165297
C  2.26809 -1.117366 1.336919
C  2.016141 0.587846 -0.555428
C  0.525587 0.723338 -0.334015
C  -2.288975 0.778789 -0.05655
C  -1.566788 -0.438705 0.039776
C  5.043043 0.577951 0.597327
C  2.023884 -2.611276 1.040192
C  -0.119744 1.929615 -0.456555
C  -1.574791 2.062626 -0.31171
C  -3.700648 0.733279 0.089586
C  -2.205431 -1.675582 0.271714
C  -4.355772 -0.487332 0.322663
C  -3.605426 -1.692459 0.413211
H  4.510862 -1.487053 0.077819
H  4.305383 -0.302504 -1.250841
H  3.039346 -1.011425 2.125673
H  1.347221 -0.656633 1.726353
H  4.751176 1.599462 0.302612
H  4.926298 0.475934 1.691941
H  6.112456 0.439712 0.355213
H  1.231302 -2.724978 0.282679
H  2.938154 -3.106109 0.666023
H  1.711289 -3.133774 1.963049
H  0.475151 2.816682 -0.684469
H  -4.24538 1.680033 0.011221
H  -1.607371 -2.589408 0.335064
H  -5.444455 -0.515319 0.433525
H  -4.117791 -2.643418 0.593335
