program: Gaussian 09
title: 000000695
version: EM64L-G09RevD.01
frameworkgroup: C1[X(C4H8O8P)]
method: RPBEPBE
basis: SDD
operation: Freq
keyword: #p
keyword: freq=noraman
keyword: PBEPBE/SDD
title: #p freq=noraman PBEPBE/SDD
converged: YES YES NO NO
title: Mulliken charges:
elementType: P O O O O O O O O C C C C H H H H H H H H
charge: 1.360507 -0.517909 -0.463772 -0.495908 -0.689753 -0.768344 -0.335587 -0.396726 -0.648420 -0.010942 -0.355426 -0.279753 0.195951 0.217836 0.244518 0.230774 0.256723 0.342767 0.353072 0.363665 0.396726
chargesum: -1.00000
title: Mulliken charges with hydrogens summed into heavy atoms:
elementType: P O O O O O O O O C C C C
charge: 1.360507 -0.517909 -0.121005 -0.142837 -0.326088 -0.768344 -0.335587 0.000000 -0.648420 0.206894 0.119866 -0.023030 0.195951
polarizability: 1.23680388e+02 2.85801270e-01 8.29787925e+01 -4.30171204e+00 -2.53581547e+00 7.83353378e+01
1716.lowfreq: -8.3023 -0.0012 0.0011 0.0020 3.6926 8.9231 35.3741 51.7452 81.1459
frequency: 35.2621 51.7401 81.1232 109.1335 126.0456 146.9652 162.7757 222.6858 235.3175 265.1345 278.4133 321.5626 340.1168 353.4904 379.6167 415.0759 447.9176 458.3660 480.0741 524.3933 565.9537 611.4569 634.1900 677.2014 704.5746 749.2578 820.1913 851.9604 878.9559 958.6468 977.1379 995.1996 1000.8941 1069.7870 1078.6410 1084.1529 1192.7852 1218.5127 1237.3585 1252.4999 1272.3155 1277.2312 1313.0811 1336.8038 1353.2310 1390.1400 1419.7378 1473.1311 1479.0997 1636.2046 2962.8756 3018.6719 3029.8897 3087.6851 3211.9097 3455.2888 3579.7675
redmass: 10.0157 7.6584 7.1890 11.6694 3.0958 3.9555 4.6906 3.8880 5.5867 3.8901 6.8684 4.9847 3.7326 7.9014 10.5777 4.0041 4.6754 5.5378 2.3647 1.8476 6.8950 7.8885 5.0247 9.5467 1.2605 3.9845 5.2729 8.9956 2.4843 7.3123 4.6360 3.9135 1.2252 7.9941 2.8943 2.3613 1.1429 1.3665 1.9603 1.1266 1.2308 1.2272 1.3073 1.3073 1.2774 1.6323 1.4734 1.1474 1.1121 3.8822 1.0837 1.0581 1.0850 1.1069 1.0635 1.0636 1.0656
irintensity: 1.9409 2.7184 1.2058 7.6844 31.1440 49.4794 16.2643 12.8241 2.5053 5.8925 12.7792 25.3229 55.9205 15.1221 70.5953 67.0841 13.0699 4.6217 42.8380 114.5146 24.4787 75.6164 85.9488 171.3199 98.2743 60.7639 60.4064 551.8571 19.6205 172.3194 57.7928 34.6112 86.9025 603.9255 64.0770 29.2879 30.3345 6.8161 598.8063 83.2714 133.8605 216.1174 412.7908 712.6593 34.4339 39.1920 63.6977 1179.9064 436.7463 31.8085 42.7272 26.4874 23.2048 18.3987 124.7019 21.7639 19.3417
temp: 298.150 k
press: 1.00000 atm
elementType: 15 8 8 8 8 8 8 8 8 6 6 6 6 1 1 1 1 1 1 1 1
symmnumber: 1
zpe: 360624.0 jmol-1
zpe.correction: 0.137354 hartree
zpe.thermalcorrener: 0.151374 hartree
zpe.thermalcorrenthalpy: 0.152318 hartree
zpe.thermalcorrgfe: 0.095985 hartree
zpe.sumelectzpe: -1099.307874 hartree
zpe.sumelectthermal: -1099.293854 hartree
zpe.sumelectthermalent: -1099.292910 hartree
zpe.sumelectthermalfe: -1099.349243 hartree
dipole: 1.7799 -0.9295 -1.5339
dipole: 2.5268
quadrupole: -127.3377 -100.5671 -96.1012
quadrupole: -10.6240 12.8523 -0.0484
quadrupole: -19.3357 7.4349 11.9008 -10.6240 12.8523 -0.0484
hfenergy: -1099.4452282 hartree
pointgroup: C01[X(C4H8O8P1)]
dipole: -0.6310001 -0.464013 0.6122173 debye
dipolederiv: 2.3624387 0.1326933 -0.1166892 0.0466693 1.773027 -0.1239484 0.0671974 0.0604664 1.8293076 -1.1536271 -0.361986 0.2318442 -0.3435696 -0.7673247 0.1274922 0.2920568 0.1706499 -0.5868889 -0.6159203 -0.1498947 0.1932859 -0.1531002 -0.6816437 0.0485834 0.1920166 0.0648466 -0.4821852 -0.7548033 0.0504113 -0.0799984 -0.0472092 -0.5679177 0.055844 -0.2918666 0.0515581 -0.5587466 -0.974869 0.0088727 -0.1512455 0.0480643 -0.3247824 0.0574661 -0.3324504 0.0126853 -1.0318456 -1.6262886 0.2987781 0.1721727 0.3018001 -0.9284419 -0.0102485 0.4042624 -0.1889171 -0.7832957 -1.2988797 0.1075784 0.0659527 0.162058 -0.559126 -0.1425143 0.2029894 -0.219055 -0.5458991 -1.8868523 -0.0077192 0.0826362 -0.3169401 -0.5830313 -0.1305375 0.0496003 -0.2181474 -0.5501078 -0.8464296 -0.0194458 0.1084611 0.0423594 -0.6474394 -0.0132279 0.137612 0.0128805 -0.7363934 0.4259815 0.0398172 -0.188416 0.1047763 0.4264835 0.0311601 -0.1183967 -0.0222186 0.3089371 0.582389 0.154 -0.119113 0.0327912 0.2123495 -0.0226901 -0.3331057 -0.1928077 0.3114542 0.4133706 0.0814273 0.0804256 -0.0310543 -0.0127593 -0.1968023 0.1451684 -0.220529 0.121281 1.8153296 0.006646 -0.0474991 0.1858355 0.6248399 0.3459551 0.0327078 0.4909474 0.4742266 0.0112842 -0.0012718 0.0289099 0.0088886 -0.0761122 -0.0969141 0.0425885 -0.0650902 -0.1428159 0.0214388 -0.0392082 0.0132416 -0.0325515 0.03581 -0.1154507 0.030245 -0.0546292 -0.0253106 -0.011896 0.0112808 0.023517 0.0155795 -0.1040752 0.107651 0.0384391 0.0985495 0.0306987 0.0036024 -0.0462163 0.0492077 -0.0500594 0.0107632 0.040326 0.0915377 0.034307 -0.0210598 0.14435 0.0186909 -0.0357161 0.083286 0.4316783 -0.0108405 -0.0709426 -0.0247317 0.2652638 0.313588 -0.0016309 0.0235692 0.1024041 0.3368206 0.0570746 0.1909279 0.0758314 0.3866613 0.3752324 -0.0143029 -0.0043497 -0.0201239 0.0571791 -0.0435944 -0.0111924 -0.0401267 0.2809533 1.7005605 -0.2685203 -0.3301969 -0.1399041 0.3437029 0.0352163 -0.7593951 0.1735306 0.455765 unknown
polarizability: 122.0711733|0.9800925|82.0237007|-9.3356978|3.0441828|80.899644 unknown
InChI: InChI=1S/C4H8O8P/c5-2-1-10-13(8,9)12-14-11-4(7)3(2)6/h2-3,5-6,8H,1H2
charge -1 multiplicity 1
21 atoms
P  2.621404 0.006663 -0.50841
O  1.610281 -1.415385 -0.494084
O  -1.762716 -2.073164 0.834123
O  -2.736904 -0.319131 -1.030217
O  3.409668 -0.221915 1.05807
O  1.67033 1.3309 -0.283042
O  -2.641398 1.2913 0.986431
O  -0.34997 1.546895 1.031982
O  3.610779 -0.053513 -1.745335
C  -0.819687 -1.470365 -0.117512
C  0.563204 -1.536755 0.543665
C  -1.361219 -0.075662 -0.553003
C  -1.467455 0.991914 0.579664
H  -0.774608 -2.081428 -1.045039
H  0.681902 -0.788505 1.348106
H  0.677809 -2.543445 0.979092
H  -0.736508 0.324187 -1.372515
H  -2.660492 -1.828474 0.474196
H  -3.285521 0.290645 -0.436754
H  3.609479 0.65461 1.47667
H  0.633522 1.408128 0.400609
