program: Gaussian 09
title: 000036180
version: EM64L-G09RevD.01
frameworkgroup: C1[X(C4H5N3O2)]
method: RPBEPBE
basis: SDD
operation: Freq
keyword: #pfreq=noraman
keyword: PBEPBE/SDD
title: #p freq=noraman PBEPBE/SDD
converged: NO NO NO NO
title: Mulliken charges:
elementType: O O N N N C C C C H H H H H
charge: -0.135803 -0.245482 -0.058587 -0.055060 -0.615388 0.198515 -0.051123 -0.701639 0.200970 0.258320 0.258447 0.243131 0.359089 0.344611
chargesum: 0.00000
title: Mulliken charges with hydrogens summed into heavy atoms:
elementType: O O N N N C C C C
charge: -0.135803 -0.245482 -0.058587 -0.055060 0.088312 0.198515 -0.051123 0.058258 0.200970
polarizability: 8.37026195e+01 -1.09102205e+00 8.19501604e+01 -4.09851441e-03 2.51557788e-02 3.47024556e+01
1716.lowfreq: -14.3218 -11.5090 -6.7880 -0.0003 0.0005 0.0008 56.7715 92.9655 169.5604
frequency: 56.7711 92.9357 169.5590 186.7230 275.1260 299.0481 393.2877 480.0846 546.6228 590.0931 604.1517 628.9087 655.5546 670.3139 688.0346 768.6961 855.6431 928.7114 1016.3845 1045.0156 1065.0595 1143.9335 1327.4655 1344.8649 1407.6534 1441.1569 1450.6687 1454.9678 1503.8172 1588.3202 1640.0483 3012.3779 3097.4660 3129.7653 3507.9639 3667.5151
redmass: 5.0135 1.0823 4.5780 6.2574 3.9899 3.3187 6.4922 4.9080 1.7150 4.2362 1.1626 4.2074 3.1337 5.2162 10.0974 8.4475 13.3149 7.3454 1.6971 1.5032 2.1500 4.1946 4.2271 8.1118 1.2507 1.5394 1.0434 6.5201 2.8104 1.4875 3.6811 1.0364 1.0972 1.1017 1.0458 1.1045
irintensity: 15.8214 0.0093 18.8047 0.1739 0.6564 2.1439 0.8865 2.7350 18.3327 24.0604 200.2843 26.2122 78.5067 4.4501 4.9921 7.1537 13.6074 6.4169 4.7573 5.4869 0.3133 36.5656 59.1236 2.2321 30.0327 45.4172 17.7339 52.4198 4.2921 94.8478 322.3219 3.3217 4.7449 9.2746 58.4853 52.7847
temp: 298.150 k
press: 1.00000 atm
elementType: 8 8 7 7 7 6 6 6 6 1 1 1 1 1
symmnumber: 1
zpe: 255610.3 jmol-1
zpe.correction: 0.097357 hartree
zpe.thermalcorrener: 0.105784 hartree
zpe.thermalcorrenthalpy: 0.106728 hartree
zpe.thermalcorrgfe: 0.063653 hartree
zpe.sumelectzpe: -469.406244 hartree
zpe.sumelectthermal: -469.397817 hartree
zpe.sumelectthermalent: -469.396873 hartree
zpe.sumelectthermalfe: -469.439948 hartree
dipole: 2.3579 -0.1172 -0.0061
dipole: 2.3608
quadrupole: -51.5456 -52.8496 -51.6466
quadrupole: -12.7245 -0.0279 0.0077
quadrupole: 0.4683 -0.8357 0.3674 -12.7245 -0.0279 0.0077
hfenergy: -469.503601 hartree
pointgroup: C01 [X(C4H5N3O2)]
dipole: -0.9217203 0.1146184 -0.0022357 debye
dipolederiv: -0.4134506 -0.1859272 0.0011268 -0.1358172 -0.2635732 0.0011953 -0.0030102 -0.0033763 -0.0740571 -0.664362 -0.1747558 0.0004768 0.0318469 -0.9213699 0.0014641 0.0002423 -0.0003416 -0.3481115 -0.0880052 -0.0462313 -0.0018501 0.2082563 0.0042009 0.0005816 0.0010513 0.0025185 -0.1460181 0.0845858 0.3589052 0.0009841 0.2626221 -0.1435191 -0.0017477 0.0025022 0.0014817 -0.1261343 -0.7178595 0.4940249 -0.0000427 0.4174589 -0.8131577 0.0000251 -0.0003057 0.0007074 -0.6814199 -0.1086078 -0.0960655 0.0004209 -0.0996348 0.4885378 -0.0006092 0.0006079 -0.0009945 0.0840075 -0.1398485 -0.0163772 -0.0007081 -0.3373574 -0.2322141 0.0002466 -0.0000398 0.0002674 0.0762384 0.0816254 -0.0860667 -0.0001339 -0.0325275 -0.1638701 0.0003033 -0.0002709 0.0012333 0.0348461 1.3822826 -0.2224182 -0.000085 -0.2578741 1.4259691 -0.0022217 -0.0002792 -0.001342 0.2694542 0.095836 -0.0216119 0.0855018 -0.0030845 0.0693852 0.0149495 0.0707474 0.0362453 0.0015468 0.0942504 -0.0221713 -0.0865595 -0.0030895 0.0698666 -0.0146101 -0.071668 -0.0362702 0.003249 -0.0702288 0.112977 0.0012391 0.019791 0.0665131 -0.0002272 0.0010414 -0.0008359 0.1273872 0.2504469 -0.0530888 -0.0002539 -0.0548151 0.228101 0.0002745 -0.0003104 0.000407 0.3885795 0.2133353 -0.0411932 -0.0001164 -0.015775 0.1851304 0.0003758 -0.0003084 0.0002998 0.3904321 unknown
polarizability: 83.5320765|-1.208352|82.1207144|-0.0030282|0.0108667|34.7024446 unknown
InChI: InChI=1S/C4H5N3O2/c1-2-3(4(5)8)7-9-6-2/h5H2,1H3
charge 0 multiplicity 1
14 atoms
O  1.77855 1.393396 0.003825
O  -2.014693 -1.234305 0.000409
N  2.144312 -0.020295 -0.004031
N  0.345319 1.527118 -0.001002
N  -2.403421 1.071482 -0.001926
C  0.974837 -0.689362 -0.002112
C  -0.120392 0.264464 -0.000089
C  0.920372 -2.187054 -0.003379
C  -1.590657 -0.04016 0.001013
H  0.373626 -2.553023 0.881864
H  0.36304 -2.550939 -0.882774
H  1.938018 -2.60657 -0.009761
H  -2.004099 2.011265 -0.003221
H  -3.414112 0.942282 -0.002916
