program: Gaussian 09
title: 000036256
version: EM64L-G09RevD.01
frameworkgroup: C1[X(C18H19ClN4O5S)]
method: RPBEPBE
basis: SDD
operation: Freq
keyword: #p
keyword: freq=noraman
keyword: PBEPBE/SDD
title: #p freq=noraman PBEPBE/SDD
converged: YES YES NO NO
title: Mulliken charges:
elementType: Cl S O O O O O N N N N C C C C C C C C C C C C C C C C C C H H H H H H H H H H H H H H H H H H H
charge: -0.076782 0.393168 -0.221831 -0.195768 -0.187565 -0.191549 -0.190000 -0.132698 0.004149 0.019141 -0.589088 -0.431784 -0.400293 0.445361 -0.314847 -0.357095 -0.347439 -0.663521 -0.631173 -0.333259 -0.236702 -0.206111 -0.508401 0.540885 -0.159317 0.153494 0.286917 -0.552007 0.146552 0.258846 0.228846 0.247856 0.223095 0.302256 0.239316 0.232400 0.219731 0.238274 0.222109 0.254354 0.212901 0.230534 0.254040 0.260439 0.299036 0.337074 0.345018 0.331440
chargesum: 0.00000
title: Mulliken charges with hydrogens summed into heavy atoms:
elementType: Cl S O O O O O N N N N C C C C C C C C C C C C C C C C C C
charge: -0.076782 0.393168 -0.221831 -0.195768 -0.187565 -0.191549 -0.190000 -0.132698 0.004149 0.019141 0.087370 0.055907 0.070657 0.445361 -0.012590 -0.117780 -0.115039 0.016593 0.066615 -0.333259 0.017338 0.054328 -0.508401 0.540885 0.139719 0.153494 0.286917 -0.214933 0.146552
polarizability: 4.45480074e+02 -6.13581390e-01 3.07793441e+02 -2.32472991e+01 -5.91294954e+00 1.96825312e+02
1716.lowfreq: -5.4905 -2.7362 -0.0022 -0.0019 0.0011 2.3367 12.0732 12.6878 17.1986
frequency: 11.9860 12.3942 17.1016 30.5655 36.0674 44.6216 54.2904 67.3445 73.7722 79.9920 85.5537 97.1258 109.3758 117.0137 133.5795 153.0178 161.8896 177.7104 201.4300 207.9167 216.2158 228.8387 259.4653 265.5416 275.8902 285.8509 304.9584 313.2333 329.4015 352.1190 369.2879 375.6210 394.5858 395.7613 418.7499 426.2023 452.3594 475.1539 480.7999 501.8794 523.7391 529.6766 554.2910 559.7451 572.6278 603.4826 613.7289 618.7881 628.9660 643.4723 656.9044 670.8616 713.8642 727.3368 733.1636 742.2605 747.0241 752.7160 766.7988 794.9690 804.3235 816.2320 871.2324 885.9420 904.7303 914.0725 934.9172 945.5409 958.4655 969.0529 981.6469 1006.3752 1021.0062 1061.7192 1070.3727 1078.4455 1085.0035 1096.0980 1096.8733 1107.6897 1130.0843 1142.1866 1143.7156 1190.7845 1192.3612 1205.3408 1212.5544 1223.1018 1248.5365 1267.7399 1287.8160 1297.2950 1306.6891 1317.6392 1342.5524 1353.0698 1359.3103 1364.3701 1366.8203 1381.0587 1390.3295 1393.0300 1395.5180 1400.1090 1428.1777 1449.1177 1457.3727 1468.5245 1469.7347 1476.6932 1484.1395 1497.3635 1516.4406 1548.8280 1550.7789 1588.2441 1595.9594 1611.5663 1635.2892 2967.6295 2983.8058 2985.6671 3010.6939 3054.7856 3066.4549 3071.7749 3082.8909 3088.7825 3095.2248 3113.3359 3140.2732 3143.0176 3158.8674 3167.9901 3175.6677 3184.3114 3513.3449 3666.4889
redmass: 8.5400 7.6584 6.1749 8.7071 6.4259 10.0687 4.6004 3.7528 5.4307 6.5447 5.4018 4.7055 4.9771 6.7346 7.6070 10.0616 9.5772 5.7281 3.5929 2.3552 1.1118 1.6666 7.4473 7.7847 6.3126 2.7253 4.0434 7.0692 7.4556 3.1005 6.2623 6.3503 5.0889 6.0992 3.2023 3.5235 3.8711 2.4161 1.9546 3.6713 2.5520 2.3809 3.7670 3.3583 3.5562 2.2484 4.8404 3.8806 6.8669 5.2022 7.2757 7.5822 3.4364 6.3386 7.4500 5.0428 5.3427 8.5980 8.7929 1.1529 1.2888 1.7708 2.1523 1.8787 10.1468 1.4240 1.6980 1.3156 1.3545 1.4236 4.1117 2.9068 1.7153 2.1557 2.7851 2.0202 3.7250 2.2437 2.4010 1.8579 1.5146 3.7129 2.1078 1.8163 12.7417 1.4616 3.3422 1.5164 1.3809 1.3572 1.3185 1.2084 1.3970 7.6325 1.2952 3.5532 1.6710 7.2719 3.8352 12.4348 1.3117 1.5337 1.2546 8.8813 3.7371 3.5353 1.0565 1.0529 1.0727 1.0673 1.0646 1.9951 1.2957 8.9464 7.5743 2.0389 6.2687 5.9450 2.3177 1.0659 1.0393 1.0357 1.0644 1.0943 1.0981 1.0947 1.0999 1.0913 1.1008 1.0995 1.0888 1.0893 1.0905 1.0941 1.0944 1.0916 1.0454 1.1040
irintensity: 1.0012 1.2864 0.8422 5.7166 0.5028 0.3859 1.1221 1.0469 0.1632 10.5353 1.1764 2.4388 2.4196 0.2532 0.6206 1.1510 6.3617 8.1176 1.1888 0.5302 0.1966 0.9669 3.5791 1.6003 0.7368 0.5906 0.8721 0.7368 2.7649 0.4262 2.6543 2.3916 4.0679 13.4679 2.8942 19.3560 5.9466 5.9603 34.1624 9.2950 9.0411 25.8627 11.4149 9.2034 52.1502 92.7747 3.3876 28.7305 0.2397 12.6947 20.1714 0.7934 3.0264 14.0406 10.7724 5.1568 4.7791 18.7099 29.3198 12.3225 4.6600 54.9355 7.4577 4.1426 37.0114 4.0567 2.7032 1.2172 0.2898 23.3755 2.2596 28.0318 29.9244 3.5830 1.3310 38.3317 33.1038 12.2916 4.6215 19.5059 1.4661 39.8327 7.7891 66.8201 436.3093 253.6284 170.2385 36.8755 39.4791 44.8488 4.8554 8.5974 7.3980 51.9944 38.7855 122.2346 150.0967 89.3147 15.6086 152.0330 23.2762 43.4587 16.7772 7.8875 1.9868 33.0364 6.1056 15.4272 4.5215 18.7290 9.8521 158.0147 64.9847 70.0716 34.9920 24.3010 132.8858 342.3609 276.0806 34.9896 23.3946 30.8970 21.5922 5.0182 2.3940 4.3333 38.9156 22.0520 52.7169 16.8372 3.0330 4.9155 13.5719 17.9611 15.8823 24.4922 60.2670 29.3046
temp: 298.150 k
press: 1.00000 atm
elementType: 17 16 8 8 8 8 8 7 7 7 7 6 6 6 6 6 6 6 6 6 6 6 6 6 6 6 6 6 6 1 1 1 1 1 1 1 1 1 1 1 1 1 1 1 1 1 1 1
symmnumber: 1
zpe: 927824.1 jmol-1
zpe.correction: 0.353390 hartree
zpe.thermalcorrener: 0.382512 hartree
zpe.thermalcorrenthalpy: 0.383456 hartree
zpe.thermalcorrgfe: 0.288599 hartree
zpe.sumelectzpe: -2148.280206 hartree
zpe.sumelectthermal: -2148.251083 hartree
zpe.sumelectthermalent: -2148.250139 hartree
zpe.sumelectthermalfe: -2148.344996 hartree
dipole: 11.0542 -1.5025 -2.6079
dipole: 11.4566
quadrupole: -204.4948 -217.1909 -165.9858
quadrupole: -5.6773 14.3113 -0.7888
quadrupole: -8.6043 -21.3004 29.9047 -5.6773 14.3113 -0.7888
hfenergy: -2148.6335954 hartree
pointgroup: C01 [X(C18H19Cl1N4O5S1)]
dipole: 4.3229359 0.1010705 1.2721922 debye
polarizability: 439.0914031|-14.358921|305.374048|38.3575129|-26.3291232|205.6333759 unknown
InChI: InChI=1S/C18H19ClN4O5S/c1-3-21(10-11(2)19)12-4-6-13(7-5-12)29-17-8-14(18(20)24)15(22(25)26)9-16(17)23(27)28/h4-9,11H,3,10,20H2,1-2H3
charge 0 multiplicity 1
48 atoms
Cl 5.140689 -3.148204 1.003793
S  -0.768287 2.718799 -0.687334
O  -1.637078 -3.155164 -0.330676
O  -5.213442 2.859789 -1.438758
O  -3.149408 3.820305 -1.278971
O  -6.010275 -1.671116 -0.257788
O  -4.459079 -2.824501 0.958313
N  4.616979 0.046655 0.425575
N  -3.954029 2.811676 -1.160125
N  -4.82827 -1.817292 0.237088
N  -1.43493 -2.504043 1.897601
C  5.257881 -0.820008 -0.57269
C  5.360036 0.308061 1.681493
C  3.379589 0.644541 0.171862
C  4.705512 -2.260129 -0.64064
C  2.755545 1.507683 1.133673
C  2.676341 0.424024 -1.061221
C  6.164396 1.627862 1.651783
C  5.287015 -3.077653 -1.793514
C  0.817983 1.843083 -0.329537
C  1.497793 2.085417 0.88674
C  1.429947 1.02426 -1.307413
C  -1.987658 1.382439 -0.408046
C  -3.384706 1.538243 -0.676113
C  -1.56721 0.110884 0.06948
C  -2.453537 -0.960523 0.275443
C  -3.831692 -0.752432 -0.009675
C  -4.295457 0.479803 -0.486778
C  -1.845893 -2.322187 0.596789
H  6.339515 -0.871166 -0.356174
H  5.165025 -0.377931 -1.586491
H  6.037802 -0.545776 1.848696
H  4.655252 0.30027 2.533128
H  3.604434 -2.270663 -0.636501
H  3.252008 1.73586 2.0797
H  3.099324 -0.212913 -1.842201
H  6.919373 1.609327 0.845082
H  5.508092 2.49884 1.480425
H  6.693273 1.776276 2.611235
H  4.921288 -4.116575 -1.76329
H  4.981379 -2.634049 -2.761422
H  6.390321 -3.096877 -1.752958
H  1.0459 2.735339 1.643775
H  0.925389 0.844396 -2.2630
H  -0.502412 -0.04475 0.264782
H  -5.355603 0.63307 -0.705209
H  -1.015202 -3.398563 2.153702
H  -1.702814 -1.855388 2.636268
