program: Gaussian 09
title: 000036237
version: EM64L-G09RevD.01
frameworkgroup: C1[X(C13H7ClN2O6)]
method: RPBEPBE
basis: SDD
operation: Freq
keyword: #p
keyword: freq=noraman
keyword: PBEPBE/SDD
title: #p freq=noraman PBEPBE/SDD
converged: YES YES NO NO
title: Mulliken charges:
elementType: Cl O O O O O O N N C C C C C C C C C C C C C H H H H H H H
charge: -0.023432 -0.303916 -0.183882 -0.176001 -0.187213 -0.194772 -0.186579 0.027594 0.022721 0.298892 0.342929 0.437974 -0.501375 -0.298549 -0.367149 0.293199 0.137887 -0.323342 -0.317202 -0.201563 -0.192724 -0.102136 0.337078 0.275993 0.299555 0.277285 0.276886 0.267215 0.264625
chargesum: 0.00000
title: Mulliken charges with hydrogens summed into heavy atoms:
elementType: Cl O O O O O O N N C C C C C C C C C C C C C
charge: -0.023432 -0.303916 -0.183882 -0.176001 -0.187213 -0.194772 -0.186579 0.027594 0.022721 0.298892 0.342929 0.437974 -0.164297 -0.022556 -0.067594 0.293199 0.137887 -0.046057 -0.040316 0.065652 0.071901 -0.102136
polarizability: 3.61080275e+02 -5.75263498e+00 1.63933400e+02 1.35126396e+01 1.28588559e+01 1.08140718e+02
1716.lowfreq: -4.7686 -2.0383 0.0018 0.0021 0.0023 0.3126 19.2957 28.3257 34.0119
frequency: 19.2229 28.2996 34.0058 48.8211 55.7122 85.4209 93.4103 121.4080 150.5575 153.3532 160.9192 214.3001 242.7806 275.7871 295.0342 306.9720 334.8781 346.1483 380.1366 407.6209 436.1980 443.9587 470.5312 481.4721 503.7644 523.7249 564.7210 620.9017 631.9453 645.6509 649.2397 672.2790 690.4443 715.5640 727.1444 732.1649 758.1572 763.1542 794.9418 837.7003 850.0784 862.3654 880.5672 948.4600 963.8574 978.4419 987.0391 996.5430 1006.8094 1052.9065 1072.5827 1105.6925 1114.3156 1134.6426 1175.5799 1190.3253 1206.3401 1218.3492 1241.0533 1252.1761 1295.1259 1363.2001 1375.7794 1377.5298 1402.7257 1403.1894 1422.7519 1462.3941 1474.3229 1576.4948 1584.8649 1598.9037 1609.7820 1674.7023 3159.9611 3170.1002 3173.9941 3180.1933 3187.1394 3190.7023 3193.3662
redmass: 13.3471 7.1833 8.0642 8.8000 12.4893 10.1479 8.5616 10.9326 10.2923 7.3610 10.9800 11.2092 8.7736 8.8369 7.0914 11.0521 12.5193 9.1337 9.5380 2.8882 4.9080 5.5450 3.6052 7.5250 8.3643 5.6247 5.6277 7.1406 8.2023 8.0889 5.1124 8.9909 6.9156 7.1566 7.3012 3.9602 11.4988 5.5181 6.4531 1.2552 1.5640 1.5489 7.8936 9.0492 1.4543 1.3581 1.3685 1.3560 3.6583 2.1548 2.9671 3.3315 1.3349 1.4986 1.8801 1.9594 6.7835 4.9784 2.5670 2.0786 1.2532 6.0708 10.4755 5.1971 7.1876 5.2056 6.2975 2.9117 2.4845 7.9014 8.9619 6.2511 7.4686 12.6312 1.0895 1.0896 1.0897 1.0972 1.0920 1.0972 1.0973
irintensity: 0.3584 0.2195 0.3176 0.1129 0.5612 1.3386 1.7547 1.7346 0.3286 2.2648 6.5708 4.0070 1.8875 4.7131 1.1446 0.4953 0.0455 3.6694 15.2086 0.0358 1.6870 2.3820 13.7115 9.3990 8.5772 27.5803 0.1082 3.6612 3.9576 21.4589 29.6201 30.9376 4.2566 4.0916 25.3129 13.0572 31.8315 20.7676 2.2517 1.9778 48.9453 41.3685 2.5229 897.4091 36.9701 0.3579 0.1800 0.1313 8.6955 134.3120 81.9028 16.8589 8.7269 41.5163 352.9240 45.6789 761.2552 51.0999 35.7759 28.9124 1.8698 103.7874 53.7919 12.1868 33.2296 13.1606 58.4403 79.9014 70.0564 10.3939 38.8537 213.7889 54.1151 284.4229 0.0607 1.0320 0.4843 2.0127 21.5331 0.6170 4.7266
temp: 298.150 k
press: 1.00000 atm
elementType: 17 8 8 8 8 8 8 7 7 6 6 6 6 6 6 6 6 6 6 6 6 6 1 1 1 1 1 1 1
symmnumber: 1
zpe: 481699.1 jmol-1
zpe.correction: 0.183469 hartree
zpe.thermalcorrener: 0.202236 hartree
zpe.thermalcorrenthalpy: 0.203180 hartree
zpe.thermalcorrgfe: 0.133108 hartree
zpe.sumelectzpe: -1518.776621 hartree
zpe.sumelectthermal: -1518.757854 hartree
zpe.sumelectthermalent: -1518.756910 hartree
zpe.sumelectthermalfe: -1518.826982 hartree
dipole: -4.0071 -4.3098 -0.2152
dipole: 5.8888
quadrupole: -160.7412 -135.0956 -129.0483
quadrupole: -4.5060 -3.8386 4.0797
quadrupole: -19.1128 6.5328 12.5800 -4.5060 -3.8386 4.0797
hfenergy: -1518.9600903 hartree
pointgroup: C01 [X(C13H7Cl1N2O6)]
dipole: 1.5712173 -1.6571217 0.3910462 debye
polarizability: 360.8450827|7.9928996|157.8757379|14.5997496|-21.5240032|114.4335732 unknown
InChI: InChI=1S/C13H7ClN2O6/c14-9-3-1-8(2-4-9)13(17)22-12-6-5-10(15(18)19)7-11(12)16(20)21/h1-7H
charge 0 multiplicity 1
29 atoms
Cl 7.17394 -0.34009 0.632982
O  0.413183 -0.729554 0.257975
O  0.752818 0.40024 -1.775797
O  -1.683547 3.011717 -0.123207
O  0.218368 2.014941 0.635375
O  -5.884958 -1.650139 0.128408
O  -5.852016 0.630529 0.018861
N  -0.999306 1.974246 0.211312
N  -5.269426 -0.516617 0.090572
C  -0.975497 -0.588866 0.197738
C  -1.677762 0.652595 0.148041
C  -3.784603 -0.541331 0.133551
C  -3.085592 0.675136 0.099086
C  -1.716179 -1.794096 0.234691
C  -3.11865 -1.785236 0.211976
C  2.672424 -0.170561 -0.371087
C  1.24727 -0.082028 -0.7433
C  3.628499 0.310619 -1.306015
C  3.101903 -0.698504 0.874881
C  5.002264 0.261546 -1.006102
C  4.474747 -0.750857 1.184557
C  5.403956 -0.271584 0.237355
H  -3.617631 1.628567 0.045096
H  -1.156913 -2.732904 0.269857
H  -3.701112 -2.709383 0.239302
H  3.281597 0.723975 -2.258292
H  2.362526 -1.057523 1.59459
H  5.746127 0.630057 -1.717429
H  4.818873 -1.151794 2.141624
