program: Gaussian 09
title: 000036188
version: EM64L-G09RevD.01
frameworkgroup: C1[X(C12H5Cl5)]
method: RPBEPBE
basis: SDD
operation: Freq
keyword: #pfreq=noraman
keyword: PBEPBE/SDD
title: #p freq=noraman PBEPBE/SDD
converged: NO YES NO NO
title: Mulliken charges:
elementType: Cl Cl Cl Cl Cl C C C C C C C C C C C C H H H H H
charge: 0.021299 0.042101 -0.007737 0.009172 0.000177 0.404174 0.305075 -0.293339 -0.369733 -0.339821 -0.360675 -0.051906 -0.219904 -0.052586 -0.187610 -0.115877 -0.108605 0.263417 0.276147 0.256000 0.267335 0.262897
chargesum: 0.00000
title: Mulliken charges with hydrogens summed into heavy atoms:
elementType: Cl Cl Cl Cl Cl C C C C C C C C C C C C
charge: 0.021299 0.042101 -0.007737 0.009172 0.000177 0.404174 0.305075 -0.293339 -0.106316 -0.063674 -0.104675 -0.051906 0.047431 -0.052586 0.075287 -0.115877 -0.108605
polarizability: 2.73621761e+02 -1.00724510e+01 1.39760067e+02 6.80142192e-01 -1.71484846e-01 1.21706580e+02
1716.lowfreq: -27.6228 -9.2293 -5.8441 -0.0015 0.0023 0.0025 2.8472 36.7366 38.0297
frequency: -27.6063 36.7265 38.0097 77.4475 114.5292 134.1887 165.8478 184.6464 190.1922 204.4997 216.5155 234.4838 295.1810 311.0493 329.0254 384.0105 424.6202 429.2816 444.5372 464.1731 474.7069 510.2008 556.8331 594.0993 604.7413 660.0834 702.8270 722.6682 736.7599 743.0517 818.7571 822.3570 834.1069 886.7935 949.4267 955.0860 998.4242 1016.9957 1077.2560 1118.7424 1143.4445 1152.9080 1162.9738 1244.8227 1291.6025 1335.9945 1346.7480 1352.3395 1376.2231 1425.4319 1469.2856 1544.7002 1560.5309 1580.3322 1600.1808 3153.8932 3157.4586 3168.0503 3176.0430 3181.1825
redmass: 9.3398 15.8903 15.4960 25.7432 7.3874 8.0703 15.1026 11.0826 16.7049 30.0148 18.5161 7.6459 8.6182 7.5516 28.1184 9.2634 4.5454 6.3472 4.8149 7.4391 9.7184 4.7768 9.2762 5.4041 5.5250 7.3056 4.0405 6.6816 7.5907 6.8610 1.5429 1.4349 4.3458 1.4767 1.3541 1.3525 7.7620 5.6839 4.0275 2.3267 1.4761 1.4134 2.2170 1.3490 2.4127 5.1673 4.8489 6.3768 4.4343 2.5950 3.5570 8.2411 8.2052 7.4271 7.0951 1.0891 1.0895 1.0929 1.0973 1.0970
irintensity: 0.4277 0.2509 0.3073 0.1136 0.3594 0.1975 0.0568 0.0361 0.0988 0.0206 0.0216 2.7013 0.0300 0.9293 0.3433 3.6087 9.9917 1.7566 15.7457 4.5332 14.4909 0.5387 1.3001 3.5395 8.6239 17.8979 5.1550 22.0414 41.7697 23.6875 55.4369 31.7147 11.0208 9.1504 0.0137 0.3272 54.1354 3.6732 16.4481 50.3595 1.5342 4.3225 34.9602 3.0469 5.7874 30.7970 9.7012 23.1881 12.4753 182.8242 11.9127 3.6137 18.2994 12.8852 3.1178 2.8036 2.2491 0.2564 1.9400 0.8571
temp: 298.150 k
press: 1.00000 atm
elementType: 17 17 17 17 17 6 6 6 6 6 6 6 6 6 6 6 6 1 1 1 1 1
symmnumber: 1
zpe: 340260.0 jmol-1
zpe.correction: 0.129598 hartree
zpe.thermalcorrener: 0.144456 hartree
zpe.thermalcorrenthalpy: 0.145400 hartree
zpe.thermalcorrgfe: 0.085498 hartree
zpe.sumelectzpe: -2759.387817 hartree
zpe.sumelectthermal: -2759.372959 hartree
zpe.sumelectthermalent: -2759.372015 hartree
zpe.sumelectthermalfe: -2759.431917 hartree
dipole: 0.5625 -2.1902 -1.7858
dipole: 2.8814
quadrupole: -149.5620 -128.0695 -127.1234
quadrupole: -4.1374 3.4784 0.0284
quadrupole: -14.6437 6.8488 7.7949 -4.1374 3.4784 0.0284
hfenergy: -2759.517415 hartree
pointgroup: C01 [X(C12H5Cl5)]
dipole: 0.2335852 0.955562 0.5634281 debye
dipolederiv: -0.2066224 -0.215786 0.0131922 -0.247984 -0.5460189 0.0257034 0.0182401 0.022292 -0.0166318 -0.3175459 0.293019 0.0113192 0.3787025 -0.3981965 -0.0144604 0.0170622 -0.0145461 0.0028536 -0.3159062 0.0011241 -0.2756241 -0.0031364 -0.0324185 0.0024925 -0.3870919 0.0045523 -0.5354711 -0.808313 -0.1480095 0.0459856 -0.1360065 -0.0879796 0.0086489 0.0553579 0.0112521 -0.0271443 -0.8227975 -0.0394151 0.091171 -0.0551005 -0.0304917 0.0072679 0.0990207 0.006149 -0.0726666 0.3506249 -0.042517 -0.0109373 -0.0930297 -0.1733529 0.0146668 -0.0400065 0.0046915 -0.0633373 0.3393056 -0.0358808 -0.0210279 -0.011541 -0.0567061 -0.0056933 0.0155753 0.0025386 0.0778521 0.0984656 0.3941798 -0.0155386 0.4329423 0.7059404 -0.0451403 -0.013169 -0.0344413 -0.0224193 -0.0946883 0.0248442 -0.0109099 0.0605462 0.0719221 -0.0019178 -0.0047989 -0.0055546 -0.1197911 -0.2621684 0.0096706 -0.1577263 -0.0202865 -0.0612889 0.0107051 -0.0020657 0.0032664 -0.1381096 -0.1626372 0.0114437 0.0564015 -0.0061937 -0.1074006 -0.0224743 -0.0648027 -0.006952 0.0426295 0.1081812 -0.5929939 0.0019321 -0.667817 0.4339522 0.0313645 -0.0018469 0.0345175 -0.021956 -0.3120282 -0.0516073 0.0119812 0.0201473 -0.0097656 -0.0034653 0.0205037 0.0026966 -0.0918906 0.1706764 -0.0101121 0.5587413 0.0040789 -0.0299789 0.0043804 0.5454206 -0.0115149 0.7806874 -0.2466088 -0.0056999 0.0275787 -0.0007915 -0.0798991 -0.0026406 -0.0273405 -0.0087892 0.0191165 1.1097153 0.3304896 -0.0745899 0.2462054 0.0166426 -0.0146012 -0.0833283 -0.0239134 -0.0407283 1.1224262 0.0770839 -0.2831941 0.0842213 -0.0528908 -0.0166325 -0.1809667 -0.0041724 -0.0973181 0.0409215 0.070243 0.0080011 0.0874355 0.0065579 -0.0016199 0.0041941 -0.002007 0.1388208 0.0879658 -0.0126788 0.0510645 -0.011156 0.1370677 0.0036518 0.0679567 0.0040929 0.0210917 0.0430054 -0.0088427 -0.082066 -0.0062844 0.1356419 0.005608 -0.0929281 0.0029776 0.0044224 0.0418788 -0.0426199 0.0073326 -0.0422434 0.0013019 0.0048173 0.00902 0.0052616 0.1639358 0.0361493 -0.0059349 0.0469132 -0.0127087 0.1573617 0.0093389 0.0459939 0.0076026 -0.0039457 unknown
polarizability: 274.086465|6.1368271|138.807939|1.5995585|-2.7641578|122.1940034 unknown
InChI: InChI=1S/C12H5Cl5/c13-8-3-1-6(5-10(8)15)7-2-4-9(14)12(17)11(7)16/h1-5H
charge 0 multiplicity 1
22 atoms
Cl 0.817958 -2.440378 0.139353
Cl 4.017928 -2.087118 -0.087538
Cl -3.982742 0.091961 -2.365034
Cl 5.289068 0.904992 -0.218412
Cl -5.419366 -0.115119 0.590378
C  0.68555 0.344231 0.114108
C  -0.803688 0.210891 0.224919
C  1.544369 -0.783022 0.068615
C  1.275154 1.632013 0.053343
C  -1.602617 0.199841 -0.943805
C  -1.429153 0.12257 1.493342
C  2.950054 -0.64086 -0.032348
C  2.670711 1.796339 -0.047871
C  -3.004805 0.101095 -0.84031
C  -2.832423 0.023307 1.59346
C  3.500732 0.659785 -0.089726
C  -3.621673 0.012534 0.42464
H  0.625861 2.512008 0.086481
H  -1.140265 0.262231 -1.933002
H  -0.821245 0.125876 2.403221
H  3.116795 2.793059 -0.094045
H  -3.319604 -0.046937 2.570032
