program: Gaussian 09
title: 000036233
version: EM64L-G09RevD.01
frameworkgroup: C1[X(C6H9N5O10)]
method: RPBEPBE
basis: SDD
operation: Freq
keyword: #p
keyword: freq=noraman
keyword: PBEPBE/SDD
title: #p freq=noraman PBEPBE/SDD
converged: YES YES NO NO
title: Mulliken charges:
elementType: O O O O O O O O O O N N N N N C C C C C C H H H H H H H H H
charge: -0.252466 -0.185175 -0.122396 -0.152076 -0.102994 -0.132828 -0.127286 -0.182864 -0.185137 -0.243982 -0.003575 0.125641 0.109104 0.128084 0.163126 0.360746 -0.461690 -0.515645 0.326886 -0.226413 -0.667752 0.318072 0.285311 0.296521 0.280049 0.237081 0.243201 0.236953 0.231554 0.219950
chargesum: 0.00000
title: Mulliken charges with hydrogens summed into heavy atoms:
elementType: O O O O O O O O O O N N N N N C C C C C C
charge: -0.252466 -0.185175 -0.122396 -0.152076 -0.102994 -0.132828 -0.127286 -0.182864 -0.185137 -0.243982 -0.003575 0.125641 0.109104 0.128084 0.163126 0.360746 0.141693 0.060925 0.326886 0.253869 0.020705
polarizability: 1.87745939e+02 -5.06475846e+00 1.45617962e+02 1.12505607e+00 4.30144861e+00 1.15966974e+02
1716.lowfreq: -2.1101 0.0003 0.0006 0.0008 3.2978 9.7331 15.0159 17.7659 44.0389
frequency: 14.9776 17.3608 44.0301 51.8468 64.4691 74.7196 85.3158 104.0627 107.7810 112.9850 134.1639 138.6014 144.0499 160.2018 175.2676 197.4846 210.8701 248.0668 255.6892 314.7868 321.7337 336.2260 347.4909 358.1383 359.3396 384.7853 411.3384 484.2523 520.8346 545.3650 561.2633 600.2553 629.6669 646.4253 670.6832 698.1564 709.6171 717.9966 759.4214 762.5489 788.0438 799.1260 817.7432 850.9179 892.0723 937.2471 955.2724 1016.7935 1058.7377 1088.3262 1114.9709 1135.7422 1148.5437 1153.4516 1155.7156 1179.0720 1212.1507 1228.1583 1253.1956 1316.8971 1338.5828 1346.1788 1361.9904 1375.8258 1402.6587 1410.7721 1424.0694 1432.7717 1445.6110 1451.1551 1456.1836 1464.1044 1472.2180 1484.7934 1638.5226 3000.0304 3014.6788 3020.3127 3034.7967 3076.9981 3081.7983 3096.9927 3107.5545 3114.2693
redmass: 7.2937 4.9453 2.6299 9.0112 10.5705 8.6848 11.9033 12.2971 10.6989 12.2775 10.1000 6.0104 3.0932 9.6021 10.4601 10.8631 9.7710 1.3080 6.4121 4.2605 9.8206 8.6872 14.3608 6.4077 4.4328 3.6682 2.1385 6.8861 4.3057 6.6605 8.7865 5.9874 8.7880 7.6439 13.1360 6.8671 8.3824 14.3780 7.6056 9.2229 6.5220 1.1025 4.9257 7.9432 5.8254 3.5428 2.5031 2.2801 10.3166 2.7739 2.2738 1.4667 9.5141 12.0687 9.3595 4.6409 10.5587 1.8016 1.1368 2.4141 1.3567 1.2784 1.4557 1.2450 1.2617 1.2810 1.5414 3.7322 11.6844 4.6345 6.1646 1.0397 1.0674 1.0667 9.7720 1.0360 1.0583 1.0584 1.0601 1.1025 1.1066 1.0985 1.1018 1.1036
irintensity: 0.4895 0.4499 0.2916 1.4065 1.1828 0.8014 1.3874 1.0361 0.7742 0.1361 0.4391 2.1877 3.4003 1.2859 8.8931 5.0627 7.7896 0.9273 2.4682 6.3473 3.2966 5.3876 1.8070 0.5374 0.2652 7.7065 3.2015 7.8555 1.3597 6.2825 0.9107 9.9084 1.6271 23.0513 5.1996 15.3001 14.4385 68.1974 57.6181 39.2283 25.7734 6.1723 39.2130 21.8126 34.5467 55.4133 15.0642 79.7409 7.3753 72.6472 4.9214 5.6721 139.3482 208.1361 302.9293 274.6184 4.8286 46.6307 0.5915 5.7285 36.2358 10.2966 6.1630 26.4136 35.2029 97.2121 124.2103 131.5103 127.2195 85.5193 88.8011 13.2643 6.0494 16.7290 248.8819 16.9396 9.6217 11.4268 1.7937 10.9678 2.2599 22.3640 0.8779 35.2872
temp: 298.150 k
press: 1.00000 atm
elementType: 8 8 8 8 8 8 8 8 8 8 7 7 7 7 7 6 6 6 6 6 6 1 1 1 1 1 1 1 1 1
symmnumber: 1
zpe: 500262.2 jmol-1
zpe.correction: 0.190540 hartree
zpe.thermalcorrener: 0.212239 hartree
zpe.thermalcorrenthalpy: 0.213183 hartree
zpe.thermalcorrgfe: 0.136820 hartree
zpe.sumelectzpe: -1258.005739 hartree
zpe.sumelectthermal: -1257.984040 hartree
zpe.sumelectthermalent: -1257.983096 hartree
zpe.sumelectthermalfe: -1258.059459 hartree
dipole: -4.4181 -1.0442 -4.1253
dipole: 6.1342
quadrupole: -113.1770 -137.1109 -120.2246
quadrupole: 10.2897 -4.5942 -5.7316
quadrupole: 10.3272 -13.6068 3.2796 10.2897 -4.5942 -5.7316
hfenergy: -1258.1962791 hartree
pointgroup: C01 [X(C6H9N5O10)]
dipole: -1.6744614 0.9952501 1.4247773 debye
polarizability: 187.7635019|2.9626782|144.6584578|-4.796562|-6.3183109|116.9089165 unknown
InChI: InChI=1S/C6H9N5O10/c1-2-21-5(12)3-7(11(19)20)4-6(8(13)14,9(15)16)10(17)18/h2-4H2,1H3
charge 0 multiplicity 1
30 atoms
O  -3.592879 0.569348 0.428719
O  0.346354 2.264182 0.751299
O  0.649449 -1.422251 -1.419267
O  3.764072 -0.309624 0.698393
O  0.808006 2.078535 -1.480618
O  2.513032 -0.282079 -2.096964
O  3.398538 1.89816 0.213367
O  -1.819353 -2.669905 1.017548
O  0.4434 -3.054253 1.004698
O  -1.662493 0.504632 -0.880356
N  -0.373366 -0.892209 1.278358
N  0.812421 1.664058 -0.284436
N  1.565841 -0.550456 -1.280338
N  3.044829 0.682544 0.331783
N  -0.59182 -2.299604 1.079932
C  1.531971 0.305261 0.026864
C  0.996206 -0.418565 1.295134
C  -1.56233 -0.072649 1.517817
C  -2.25453 0.347949 0.21139
C  -4.396478 1.037377 -0.756937
C  -5.831453 1.204766 -0.275286
H  1.657311 -1.288638 1.459719
H  1.129142 0.290651 2.131846
H  -2.280344 -0.619864 2.148113
H  -1.242366 0.840709 2.049447
H  -3.948216 1.980692 -1.116314
H  -4.294102 0.274922 -1.548845
H  -6.236868 0.249781 0.099005
H  -5.895565 1.954377 0.531484
H  -6.46411 1.544754 -1.115057
