program: Gaussian 09
title: 000000690
version: EM64L-G09RevD.01
frameworkgroup: C1[X(C6H10N2O2)]
method: RPBEPBE
basis: SDD
operation: Freq
keyword: #p
keyword: freq=noraman
keyword: PBEPBE/SDD
title: #p freq=noraman PBEPBE/SDD
converged: NO YES NO NO
title: Mulliken charges:
elementType: O O N N C C C C C C H H H H H H H H H H
charge: -0.418215 -0.213475 -0.382927 -0.063059 -0.155920 -0.437182 -0.501394 0.204763 0.163004 -0.782094 0.266091 0.236495 0.237114 0.218674 0.229369 0.300735 0.267390 0.227417 0.221074 0.382138
chargesum: 0.00000
title: Mulliken charges with hydrogens summed into heavy atoms:
elementType: O O N N C C C C C C
charge: -0.036077 -0.213475 -0.082192 -0.063059 0.110171 0.036428 -0.053350 0.204763 0.163004 -0.066213
polarizability: 9.10386396e+01 -6.20665417e+00 8.40080962e+01 -1.52669268e+00 -3.10514692e+00 6.72626605e+01
1716.lowfreq: -14.2893 -11.9683 -4.2297 -0.0010 -0.0009 -0.0007 25.5946 60.1527 105.8316
frequency: 25.5580 60.1107 105.8305 128.5959 245.5800 248.6297 324.1717 332.4378 382.8744 438.1697 461.8866 533.4158 552.1238 594.3008 614.5689 660.7487 709.6830 793.6152 845.5398 870.3462 911.1564 947.9801 1018.5608 1023.9765 1041.8728 1065.7321 1118.1346 1153.8260 1183.6664 1205.7049 1250.4651 1265.3386 1276.0024 1331.0472 1334.1559 1349.2905 1386.0029 1449.7449 1456.6686 1467.2124 1468.9233 1481.0431 1646.8474 1670.0204 2963.1001 2981.4571 2990.8757 3017.8972 3038.5569 3060.4259 3092.0800 3133.7192 3516.2797 3566.4016
redmass: 8.6500 5.6395 1.6552 1.5783 2.4242 3.0788 3.0079 2.4909 2.7165 1.7366 2.9373 4.6073 2.9802 1.7219 3.8651 2.4209 2.8259 5.4634 2.8867 2.4576 2.4138 2.5632 1.7676 2.6896 1.6823 1.7886 3.4494 1.7541 1.5071 1.4102 1.4789 1.8725 1.5778 1.5463 1.3766 1.4528 1.2790 1.2124 1.0863 1.0775 1.0553 1.4946 6.0784 9.2269 1.0680 1.0386 1.0821 1.0674 1.0906 1.0979 1.1024 1.0969 1.0643 1.0777
irintensity: 1.0249 0.1614 2.7026 1.2391 26.0873 0.7100 3.8597 6.9362 39.4034 86.0541 7.3576 33.3896 11.3508 79.9511 6.5983 58.0484 7.5436 2.7492 3.3843 5.0979 8.0759 5.7144 7.8889 251.3759 40.3889 10.9989 0.9184 1.9411 10.8869 5.2139 23.9471 16.4635 53.2694 5.1175 14.4251 3.4279 33.8073 85.1770 12.2053 3.8070 19.4663 72.5969 156.5707 187.4862 49.6971 26.6689 18.3926 19.2588 49.7014 22.2248 18.7982 8.2089 22.0044 17.2217
temp: 298.150 k
press: 1.00000 atm
elementType: 8 8 7 7 6 6 6 6 6 6 1 1 1 1 1 1 1 1 1 1
symmnumber: 1
zpe: 423432.3 jmol-1
zpe.correction: 0.161277 hartree
zpe.thermalcorrener: 0.171383 hartree
zpe.thermalcorrenthalpy: 0.172327 hartree
zpe.thermalcorrgfe: 0.124764 hartree
zpe.sumelectzpe: -493.811055 hartree
zpe.sumelectthermal: -493.800949 hartree
zpe.sumelectthermalent: -493.800004 hartree
zpe.sumelectthermalfe: -493.847568 hartree
dipole: -2.2838 -0.6823 2.5057
dipole: 3.4583
quadrupole: -55.8351 -59.2901 -60.2618
quadrupole: -5.1391 4.6292 -3.0789
quadrupole: 2.6272 -0.8278 -1.7995 -5.1391 4.6292 -3.0789
hfenergy: -493.9723317 hartree
pointgroup: C01 [X(C6H10N2O2)]
dipole: -0.9316285 -0.2129056 0.9685081 debye
dipolederiv: -1.1597155 0.3423864 0.154665 0.3099631 -0.4955354 0.0231755 0.0128642 0.0452262 -0.3177984 -0.6088856 -0.0292676 -0.0843348 0.1588052 -0.6946852 -0.2633662 0.0121525 -0.383033 -0.5426651 -0.9401376 -0.2347226 0.2350009 0.0296259 -0.3891427 0.0169647 0.2244909 0.2330667 -0.6937714 -0.4277754 -0.0108114 0.0729469 -0.051902 -0.7784495 0.2384153 0.0516083 0.17674 -0.5194275 0.5088078 -0.0352263 -0.0501351 -0.3524845 -0.0063745 0.0165055 -0.0474648 -0.0731665 0.1670689 -0.0489481 0.0589373 0.0385979 0.1498471 0.0540762 0.0734675 0.0277397 0.0134211 0.0119791 0.1873973 -0.0933078 0.0715086 -0.0692169 0.3675577 -0.0486922 0.0548288 0.0250481 0.2503228 0.8760207 0.165067 -0.4340261 0.101182 0.7812761 -0.4474338 -0.4114657 -0.4898877 0.5081911 1.3209354 -0.2432904 0.0850137 -0.3426953 0.8253529 0.4154534 0.1212587 0.548887 0.5769282 -0.1692793 0.0878835 0.0494643 0.1521219 -0.0826818 0.0177472 0.0293258 0.040412 0.0552091 -0.0557372 -0.0247798 0.0721119 -0.0049782 0.084513 0.0267035 0.0824436 0.0281225 -0.064116 0.031815 -0.084124 -0.0959138 -0.0721922 0.022277 -0.0440634 -0.0505273 -0.0598936 -0.0808022 -0.0751127 0.1263317 0.017645 0.0972872 0.0415588 0.0110912 0.016116 -0.0044409 0.0926837 -0.0433345 0.1012236 -0.1370058 -0.0115112 0.0446781 -0.056934 -0.0934348 -0.021227 -0.0960937 0.0330059 -0.055629 0.0142737 -0.0206255 -0.186612 0.0534657 0.0389673 0.0081973 0.0833827 0.1653394 0.0022724 0.0806425 0.0392783 0.1022167 0.0758595 0.0626784 0.0092212 0.3121319 0.0053448 -0.0258153 0.0576012 -0.0895888 0.0909049 0.057258 0.0979835 0.0297581 0.066937 0.0581477 -0.0636702 -0.0453883 -0.0002154 -0.1165238 -0.0659414 -0.0185506 -0.0762705 0.0806539 0.057748 0.0475526 -0.0372005 0.0445774 0.0734278 0.0269224 -0.1041608 0.0658476 -0.1239016 0.2843637 -0.0310102 -0.0654673 -0.0672779 0.2621658 -0.1265983 -0.1068536 -0.1160286 0.2330872 unknown
polarizability: 90.3777966|-6.5067324|84.6971634|-1.2082698|-3.2272428|67.2344362 unknown
InChI: InChI=1S/C6H10N2O2/c1-4-7-3-2-5(8-4)6(9)10/h5,8-9H,2-3H2,1H3
charge 0 multiplicity 1
20 atoms
O  -2.932556 0.159326 -0.020557
O  -1.554289 -1.472524 -0.937882
N  0.568294 -0.712088 0.823218
N  1.715153 0.833408 -0.646436
C  -0.685808 0.031258 0.862738
C  -0.388489 1.536963 0.604387
C  0.50073 1.692956 -0.651108
C  1.661382 -0.281363 0.045064
C  -1.713793 -0.529182 -0.138827
C  2.853512 -1.216574 0.061246
H  -1.152423 -0.065517 1.863345
H  0.15195 1.923509 1.487705
H  -1.335968 2.091916 0.505193
H  -0.084483 1.467321 -1.567554
H  0.831124 2.743274 -0.744718
H  0.580082 -1.666981 1.179883
H  3.661104 -0.764515 -0.531683
H  2.594406 -2.197749 -0.380345
H  3.216169 -1.391095 1.091783
H  -3.593197 -0.224443 -0.65855
