program: Gaussian 09
title: 000036438
version: EM64L-G09RevD.01
frameworkgroup: C1[X(C26H28ClN3O)]
method: RPBEPBE
basis: SDD
operation: Freq
keyword: #p
keyword: freq=noraman
keyword: PBEPBE/SDD
title: #p freq=noraman PBEPBE/SDD
converged: YES YES NO NO
title: Mulliken charges:
elementType: Cl O N N N C C C C C C C C C C C C C C C C C C C C C C C C C C H H H H H H H H H H H H H H H H H H H H H H H H H H H H
charge: -0.059685 -0.235868 -0.255109 -0.095526 -0.081183 -0.018325 -0.460024 0.230750 0.090624 0.241514 0.421736 -0.358614 -0.425841 -0.357566 -0.405932 -0.363257 -0.502449 -0.264692 -0.209864 -0.626328 -0.245035 -0.263747 -0.623299 -0.619279 0.483905 -0.242205 -0.351394 -0.448161 -0.213746 -0.201437 -0.109464 0.237026 0.234877 0.187809 0.234157 0.259092 0.254613 0.258993 0.265495 0.240989 0.249399 0.228901 0.226708 0.242421 0.239310 0.246085 0.224414 0.225264 0.219424 0.189690 0.231394 0.221761 0.227919 0.186045 0.228355 0.253337 0.245138 0.254857 0.256030
chargesum: 0.00000
title: Mulliken charges with hydrogens summed into heavy atoms:
elementType: Cl O N N N C C C C C C C C C C C C C C C C C C C C C C C C C C
charge: -0.059685 -0.235868 -0.255109 -0.095526 -0.081183 -0.018325 0.011880 0.230750 0.090624 0.241514 0.421736 0.063352 -0.166749 -0.102953 -0.146939 -0.097762 -0.012061 -0.035792 0.016844 0.101488 -0.020621 -0.038484 0.017209 0.016445 0.483905 -0.013850 -0.098057 -0.203023 0.041111 0.054593 -0.109464
polarizability: 3.84750299e+02 1.71453639e+01 2.38987015e+02 1.09163710e+01 -1.14901478e+01 3.15048908e+02
1716.lowfreq: -19.2378 -4.1122 0.0011 0.0011 0.0015 3.7155 6.2402 12.1516 20.3387
frequency: -17.9947 12.0939 20.2398 24.9638 36.1948 37.3788 46.7040 55.3223 59.6832 77.8087 86.3888 104.7731 135.4103 136.2211 148.2409 165.4518 180.5541 200.7963 208.9723 211.9236 218.2265 229.5532 244.8469 250.4437 259.3076 289.8553 298.7251 311.7718 327.6118 339.3459 352.6871 378.1383 396.9770 404.2747 410.3633 423.9362 427.5680 441.1890 477.7476 482.7413 498.0741 500.7903 517.4553 566.5296 600.7744 615.7770 618.6902 625.8975 657.0321 666.5518 685.2005 702.4012 708.4539 712.3957 736.6290 762.9740 767.1298 776.9316 794.3378 803.6594 829.9511 832.3330 832.4040 853.4346 873.9693 881.7795 902.6918 925.0855 936.2884 946.8047 951.6005 969.0556 978.6794 980.9957 983.3285 990.4692 996.0848 1000.8145 1005.9071 1016.0591 1027.1613 1033.3134 1035.3752 1048.0497 1070.5874 1073.2495 1078.3493 1087.6184 1092.1484 1095.4736 1103.9697 1107.1909 1118.2987 1136.2115 1152.9501 1169.2240 1170.2857 1173.7019 1178.3131 1185.1372 1198.5547 1202.7293 1215.5747 1230.2203 1238.7949 1248.7125 1265.1472 1289.0850 1293.1889 1302.2009 1312.4171 1315.6294 1325.0463 1342.3329 1371.4364 1377.9824 1381.6046 1395.1817 1404.4390 1419.4557 1423.9343 1433.1793 1441.3668 1451.1943 1453.2972 1462.0091 1462.9580 1467.3290 1470.8528 1471.5416 1475.3873 1478.0871 1480.2346 1481.5378 1486.3120 1487.7701 1587.7137 1588.3663 1600.9149 1601.6634 1607.5439 1618.9753 1641.9268 2823.8749 2846.8443 2862.0327 2956.9093 2962.9268 3009.2229 3018.2156 3024.2804 3026.2828 3031.5807 3068.5695 3075.3348 3078.3087 3088.6090 3110.0668 3123.2101 3128.5778 3132.2765 3133.3017 3139.0293 3145.6412 3149.1432 3157.9221 3158.8404 3167.5195 3168.6338 3172.1814 3172.3993
redmass: 2.7103 6.3533 4.2069 5.1528 3.9541 4.0385 4.9515 4.4173 4.0962 4.1711 5.8152 2.3202 5.2826 5.3905 4.2088 4.7320 3.3622 2.1330 1.4142 2.0181 1.4187 1.7739 2.0836 4.0422 3.2679 5.1941 4.2618 4.7659 2.6519 5.2687 2.4614 4.6711 4.4038 2.8642 2.8967 3.2396 3.0933 3.0275 3.7391 5.6466 4.1241 3.7750 4.3354 4.9442 4.2705 6.0126 5.6966 6.8445 4.9597 4.9212 6.2251 2.5839 3.3518 2.8731 2.6911 1.3304 2.4369 2.0101 2.5346 3.4431 2.5860 1.7401 1.5698 1.2548 1.5817 2.4803 3.9625 1.4572 3.1379 1.4215 1.5597 1.3718 1.4014 1.7771 1.3726 4.4066 1.4328 4.0159 3.5002 2.2609 2.5660 1.5895 2.0971 2.9819 2.7007 2.0341 2.2153 1.9707 1.4615 1.9110 1.3707 1.9412 1.5038 1.5757 1.8623 1.5511 1.4797 1.1124 1.1156 2.6234 1.1283 2.1866 2.9327 2.2355 1.9049 1.6688 2.5273 1.4969 1.3251 1.2602 1.7049 2.6236 1.4015 1.8530 1.6121 3.9931 5.0324 2.4118 4.6146 1.1422 1.1993 2.2539 1.1626 1.1701 2.2450 1.0527 1.0938 1.0960 2.4710 1.5146 1.1006 1.0987 1.5500 1.9958 1.0606 1.0610 6.0485 7.4360 7.4721 6.3449 6.1001 7.9648 9.8322 1.0696 1.0574 1.0574 1.0616 1.0409 1.0592 1.0720 1.0989 1.0847 1.0742 1.0926 1.1026 1.1009 1.1000 1.1019 1.0846 1.0862 1.0900 1.0888 1.0905 1.0884 1.0930 1.0949 1.0953 1.0995 1.0959 1.0979 1.0964
irintensity: 0.3915 0.0381 0.0402 0.1035 0.1262 0.2628 1.6375 0.1844 0.2344 0.3232 0.3129 0.9425 3.0200 2.6206 2.2444 1.1039 0.0063 0.0844 0.7038 1.7552 0.7142 0.4428 3.9423 1.1180 1.4774 1.4326 0.9230 2.7864 18.3160 3.2338 1.6906 7.2757 6.4124 0.2878 0.3274 5.8103 5.7609 0.4351 12.2928 3.3685 16.6148 0.9343 12.8585 1.5497 19.3429 5.3291 14.3643 0.6310 15.9278 5.2521 5.4542 24.3562 16.1593 21.4819 1.8311 67.9761 13.6097 30.3894 18.2789 14.9684 20.4430 21.1733 23.3688 1.4743 5.3125 13.8252 11.1884 3.3282 19.8116 0.7770 4.6700 0.6525 0.4814 5.0173 0.8930 0.5742 3.0599 65.7673 8.8084 7.7987 15.8797 22.3247 37.1110 31.7368 36.3660 10.6506 14.0319 16.2893 9.1301 5.7742 3.5844 10.6035 5.5495 7.7279 4.7119 14.8749 6.2599 1.0492 1.9879 71.7082 3.8140 9.6955 1.6291 7.9683 4.4958 17.3364 7.2390 23.6612 2.6132 12.3317 6.5254 12.3241 0.9775 6.5839 4.8740 1.0988 2.1666 3.8693 2.0798 4.0899 15.5462 9.2453 1.6233 8.7124 34.0819 23.4208 15.7597 8.7542 74.8742 45.5647 10.9307 23.4082 21.1567 49.2437 19.8070 7.3614 0.6971 0.6468 29.7844 8.1583 21.3473 136.7460 66.6433 95.3910 64.5934 196.2106 25.0111 36.7790 15.4225 43.9147 13.7069 23.3686 40.2681 16.2844 3.6419 47.6729 42.6082 25.9705 0.4141 0.9513 7.3465 11.7179 15.1882 4.9955 22.2972 9.4943 30.2072 22.1120 6.3988 14.0576 2.2857
temp: 298.150 k
press: 1.00000 atm
elementType: 17 8 7 7 7 6 6 6 6 6 6 6 6 6 6 6 6 6 6 6 6 6 6 6 6 6 6 6 6 6 6 1 1 1 1 1 1 1 1 1 1 1 1 1 1 1 1 1 1 1 1 1 1 1 1 1 1 1 1
symmnumber: 1
zpe: 1254835.0 jmol-1
zpe.correction: 0.477941 hartree
zpe.thermalcorrener: 0.506718 hartree
zpe.thermalcorrenthalpy: 0.507662 hartree
zpe.thermalcorrgfe: 0.415515 hartree
zpe.sumelectzpe: -1704.833345 hartree
zpe.sumelectthermal: -1704.804568 hartree
zpe.sumelectthermalent: -1704.803624 hartree
zpe.sumelectthermalfe: -1704.895771 hartree
dipole: -1.3377 0.2361 1.2046
dipole: 1.8155
quadrupole: -208.1133 -184.7010 -178.4968
quadrupole: 4.0821 -2.1845 -4.1056
quadrupole: -17.6763 5.7360 11.9402 4.0821 -2.1845 -4.1056
hfenergy: -1705.3112864 hartree
pointgroup: C01 [X(C26H28Cl1N3O1)]
dipole: -0.5261581 0.2085158 0.4357434 debye
polarizability: 385.9198892|11.2555056|235.9154437|9.1482831|3.5235068|316.9508886 unknown
InChI: InChI=1S/C26H28ClN3O/c1-28(2)18-17-26(21-9-5-4-6-10-21)23-11-7-8-12-24(23)30(25(26)31)29(3)19-20-13-15-22(27)16-14-20/h4-16H,17-19H2,1-3H3
charge 0 multiplicity 1
59 atoms
Cl 8.419415 -0.665858 0.098202
O  -0.472559 -0.417354 -2.022873
N  0.185339 -0.514924 0.250246
N  1.540014 -0.9298 0.099446
N  -2.139738 3.933335 -1.010756
C  -2.096508 0.113955 -0.141469
C  -2.581242 1.479035 -0.73525
C  -1.725206 0.208458 1.337774
C  -0.732975 -0.297521 -0.795352
C  -0.377133 -0.193685 1.5183
C  -3.13739 -0.991907 -0.464618
C  -1.590085 2.643319 -0.531025
C  -2.46826 0.637803 2.44892
C  0.246871 -0.217692 2.775678
C  -3.819807 -1.711589 0.54775
C  -3.422202 -1.296068 -1.823567
C  2.345391 0.080474 -0.662601
C  -1.86027 0.63334 3.732494
C  -0.52142 0.201301 3.890776
C  1.62958 -2.31814 -0.435629
C  -4.779391 -2.694672 0.211813
C  -4.377714 -2.278505 -2.157388
C  -2.256946 4.011865 -2.482066
C  -1.398083 5.088283 -0.463526
C  3.839698 -0.141274 -0.473415
C  -5.067452 -2.979787 -1.140802
C  4.383618 -0.386376 0.813151
C  4.718126 -0.066255 -1.581551
C  5.773623 -0.548939 0.99654
C  6.114574 -0.219877 -1.418703
C  6.619224 -0.458956 -0.127317
H  -3.545773 1.74635 -0.265033
H  -2.770971 1.322971 -1.81164
H  -0.616198 2.399299 -1.033833
H  -1.381688 2.752796 0.549352
H  -3.502691 0.979082 2.329434
H  1.286015 -0.543828 2.874862
H  -3.600473 -1.515059 1.601132
H  -2.86647 -0.787279 -2.618046
H  2.057052 1.070732 -0.261063
H  2.088757 0.071391 -1.743085
H  -2.431611 0.965238 4.605826
H  -0.068037 0.196623 4.888356
H  2.688922 -2.623355 -0.415517
H  1.057415 -2.991322 0.223014
H  1.243277 -2.401704 -1.471948
H  -5.297579 -3.238489 1.010006
H  -4.579411 -2.500875 -3.21137
H  -2.704639 4.98202 -2.762301
H  -1.270416 3.919673 -3.004671
H  -2.919711 3.216459 -2.861612
H  -1.896016 6.026727 -0.767328
H  -1.399195 5.042613 0.64008
H  -0.332862 5.138616 -0.807298
H  -5.811453 -3.741405 -1.399986
H  3.706474 -0.46375 1.670296
H  4.313951 0.11272 -2.584847
H  6.191797 -0.738037 1.989605
H  6.790243 -0.1605 -2.276667
