program: Gaussian 09
title: 000036160
version: EM64L-G09RevD.01
frameworkgroup: C1[X(C12H2Br8O)]
method: RPBEPBE
basis: SDD
operation: Freq
keyword: #p
keyword: freq=noraman
keyword: PBEPBE/SDD
title: #p freq=noraman PBEPBE/SDD
converged: NO NO NO NO
title: Mulliken charges:
elementType: Br Br Br Br Br Br Br Br O C C C C C C C C C C C C H H
charge: 0.150353 0.150599 0.143652 0.143659 0.145396 0.078506 0.076227 0.078749 -0.262148 0.577994 0.513263 -0.357001 -0.357314 -0.144151 -0.144357 -0.203609 -0.429625 -0.214014 -0.174674 -0.121475 -0.218492 0.288594 0.279867
chargesum: 0.00000
title: Mulliken charges with hydrogens summed into heavy atoms:
elementType: Br Br Br Br Br Br Br Br O C C C C C C C C C C C C
charge: 0.150353 0.150599 0.143652 0.143659 0.145396 0.078506 0.076227 0.078749 -0.262148 0.577994 0.513263 -0.357001 -0.357314 -0.144151 -0.144357 -0.203609 -0.429625 0.074581 -0.174674 0.158391 -0.218492
polarizability: 3.48539093e+02 6.56259503e-01 2.49623662e+02 2.47223248e+01 2.76992170e-01 2.40821193e+02
1716.lowfreq: -0.0004 -0.0003 0.0003 2.1631 2.9503 3.3300 10.4582 10.9245 18.2200
frequency: 10.4467 10.8972 18.2194 36.9449 39.3879 40.0884 53.4067 82.3042 111.3640 119.7010 132.1842 136.2046 138.6715 145.9152 149.2343 167.7270 193.2268 200.6351 206.1098 211.9264 225.8619 276.4062 290.8498 305.4170 332.4393 342.4594 402.8480 422.7708 439.1097 516.5528 527.3660 579.0070 580.1803 598.4514 600.0211 638.1531 668.9591 686.2560 694.9469 744.3422 766.1164 826.5826 856.2030 879.1585 908.5879 1013.8589 1035.5272 1105.9799 1170.1983 1213.6495 1245.7626 1282.2445 1306.7022 1310.1234 1320.5636 1360.2852 1433.4338 1490.1110 1499.4310 1552.0873 1570.3533 3165.4650 3179.6233
redmass: 56.1032 39.9869 55.0689 73.3818 70.4895 61.1716 55.3366 64.0589 10.2380 62.2977 55.6027 62.6988 43.9163 21.0459 77.9236 20.2006 5.3370 50.2382 63.0305 68.1288 71.6180 15.0706 14.0533 12.2846 13.8701 12.6967 9.9322 10.6834 3.0628 8.3198 13.7281 10.4683 12.0428 12.4358 11.3628 9.0105 10.2974 3.5174 10.5713 11.5676 12.3700 11.3605 1.5250 1.3863 11.0159 7.6536 11.2215 2.0492 7.7137 4.7957 1.2465 12.0215 12.0014 9.1696 11.6400 10.0008 2.8620 12.0013 11.8071 9.1839 8.3733 1.0917 1.0928
irintensity: 0.0034 0.0082 0.0008 0.0018 0.0047 0.0092 0.0311 0.0561 0.0006 0.2183 0.1520 0.5134 0.2028 0.5230 0.0022 0.8434 0.0024 0.0150 0.0041 0.0251 0.0227 0.1525 1.5257 0.0430 4.5379 1.2274 0.7282 7.6068 10.2703 4.7838 29.4898 18.0555 0.2693 20.8455 1.4462 22.8308 12.3265 1.6000 24.4557 8.1196 0.6980 5.9983 3.0998 24.0260 29.8063 188.9585 26.6304 47.7410 43.2268 69.5665 6.2212 155.8483 18.2869 4.0621 597.2033 17.3530 316.7180 1.9988 3.4538 0.6980 34.9306 0.4449 0.2436
temp: 298.150 k
press: 1.00000 atm
elementType: 35 35 35 35 35 35 35 35 8 6 6 6 6 6 6 6 6 6 6 6 6 1 1
symmnumber: 1
zpe: 260600.7 jmol-1
zpe.correction: 0.099258 hartree
zpe.thermalcorrener: 0.122217 hartree
zpe.thermalcorrenthalpy: 0.123162 hartree
zpe.thermalcorrgfe: 0.037417 hartree
zpe.sumelectzpe: -639.847125 hartree
zpe.sumelectthermal: -639.824166 hartree
zpe.sumelectthermalent: -639.823221 hartree
zpe.sumelectthermalfe: -639.908966 hartree
dipole: -0.9597 -0.0025 -0.2021
dipole: 0.9807
quadrupole: -188.8212 -188.9853 -195.6769
quadrupole: 0.1631 5.8054 -0.1223
quadrupole: 2.3399 2.1758 -4.5158 0.1631 5.8054 -0.1223
hfenergy: -639.946383 hartree
pointgroup: C01 [X(C12H2Br8O1)]
dipole: 0.3809618 -0.061122 -0.0022801 debye
dipolederiv: -0.1076764 0.0933741 -0.2890358 0.0800634 0.020474 0.1387644 -0.2751352 0.1271373 -0.3532564 -0.1085726 0.0637724 0.2977482 0.051791 0.0435343 -0.0980347 0.2824206 -0.0863037 -0.3746913 -0.0962689 0.0344765 -0.2656956 0.0722067 0.0390845 0.1246717 -0.3164517 0.1028543 -0.4278975 -0.0970268 0.0076503 0.2683548 0.0400254 0.0571474 -0.0754839 0.3223705 -0.0537309 -0.4449416 -0.568071 0.1866932 0.0088688 0.2396606 -0.0108302 -0.0046982 0.0115718 -0.0046246 0.0836732 -0.0029246 0.0444942 0.0025292 -0.0111484 -0.6360629 -0.0357384 -0.0005498 -0.0365265 0.023343 0.0045155 0.0861847 0.0046955 -0.0659682 -0.6195496 -0.035116 -0.0037223 -0.0352186 0.0180444 -0.5706809 -0.2701167 -0.0135326 -0.2665368 -0.1118887 -0.0065523 -0.0127961 -0.0062736 0.01798 -2.3682378 -0.255274 -0.0132726 -0.1616718 -0.3179825 -0.0027395 -0.0072098 -0.0021301 -0.2615326 1.3421724 0.0734948 0.0044026 -0.5552438 0.0706513 0.0094942 -0.0282087 0.0088862 -0.1128622 1.7222559 0.2705583 0.0134799 0.9646226 -0.0047636 -0.009618 0.0492658 -0.009391 0.1559663 0.0104149 -0.1832357 0.4741614 -0.0922534 -0.0152266 -0.2053365 0.6058709 -0.2812423 0.4579907 0.0127656 -0.1345424 -0.4913305 -0.0299652 -0.0593434 0.1518988 -0.612882 0.2278619 0.4997657 -0.0714459 0.0105403 0.5183147 -0.0209648 -0.0368618 -0.2263101 0.6439277 -0.2281217 0.6197367 -0.0694137 0.0624042 -0.515398 0.0438071 -0.0760358 0.1561502 -0.6438072 0.1580906 0.6564365 0.8607918 -0.3207611 -0.0151853 -0.3596255 0.0486527 0.0229366 -0.0171368 0.0228512 -0.4083097 -0.2774909 -0.1271398 -0.0072134 -0.1185514 1.1610203 0.0711552 -0.006953 0.0722948 -0.147935 -0.3312453 0.0829059 0.0044776 -0.3353247 -0.3621216 -0.015756 -0.0177395 -0.0158603 -0.0724169 -0.0701723 -0.1677616 -0.0088952 -0.100335 1.0887745 0.0649284 -0.0052118 0.0644991 -0.0764292 -0.1883422 -0.025917 -0.0011791 -0.1274723 -0.2816153 -0.014394 -0.0066406 -0.0149873 -0.0081387 0.9070153 0.400795 0.0194113 0.614532 -0.1177605 -0.0018283 0.0305751 -0.0014629 -0.1151173 0.0369493 0.0346061 0.0022007 0.102307 0.0603408 -0.0034989 0.0058887 -0.0037836 0.1236465 0.0306888 0.0327982 0.0020933 0.0360456 0.0603628 -0.0048946 0.0025535 -0.0048185 0.1469454 unknown
polarizability: 350.6767063|-19.3807182|238.681386|-1.1076486|-0.0949233|249.6258555 unknown
InChI: InChI=1S/C12H2Br8O/c13-3-1-5(15)6(2-4(3)14)21-12-10(19)8(17)7(16)9(18)11(12)20/h1-2H
charge 0 multiplicity 1
23 atoms
Br 0.631406 1.040774 -2.812035
Br 0.62622 0.752597 2.901057
Br 3.808569 -0.486165 2.904094
Br 3.813305 -0.192457 -2.934202
Br 5.391712 -0.95627 -0.044819
Br -2.769001 3.208627 0.17528
Br -2.579523 -3.491175 -0.191936
Br -5.638798 -1.788038 -0.090343
O  -0.324788 1.360635 0.067926
C  0.935095 0.744468 0.037195
C  -1.495728 0.580021 0.028034
C  1.594121 0.559386 -1.204106
C  1.592231 0.436308 1.254777
C  2.917062 -0.069282 1.233755
C  2.919051 0.054331 -1.23177
C  3.580257 -0.263096 -0.011306
C  -2.731019 1.269756 0.068811
C  -1.478088 -0.827594 -0.048999
C  -2.689486 -1.550318 -0.085397
C  -3.937322 0.547641 0.032711
C  -3.925475 -0.864666 -0.044694
H  -0.525558 -1.363738 -0.081414
H  -4.889744 1.082252 0.065078
