program: Gaussian 09
title: 000036127
version: EM64L-G09RevD.01
frameworkgroup: C1[X(C10H19N3O)]
method: RPBEPBE
basis: SDD
operation: Freq
keyword: #p
keyword: freq=noraman
keyword: PBEPBE/SDD
title: #p freq=noraman PBEPBE/SDD
converged: YES YES NO NO
title: Mulliken charges:
elementType: O N N N C C C C C C C C C C H H H H H H H H H H H H H H H H H H H
charge: -0.228414 -0.138480 -0.124367 -0.095345 0.000664 -0.081114 -0.055107 -0.748656 -0.705251 -0.677229 -0.706119 -0.694659 0.156997 -0.142435 0.190346 0.237334 0.215775 0.219876 0.222004 0.222664 0.253277 0.202778 0.213763 0.207683 0.216686 0.222664 0.231664 0.217405 0.201360 0.225697 0.212250 0.248165 0.278124
chargesum: 0.00000
title: Mulliken charges with hydrogens summed into heavy atoms:
elementType: O N N N C C C C C C C C C C
charge: -0.228414 -0.138480 -0.124367 -0.095345 0.191010 0.156220 0.160668 -0.084111 -0.035433 -0.030196 -0.055690 -0.008547 0.156997 0.135689
polarizability: 1.48332275e+02 -4.59517877e+00 1.18854721e+02 3.56824120e+00 4.31073611e+00 1.23727171e+02
1716.lowfreq: -16.5374 -11.5348 -0.0003 0.0004 0.0005 7.9610 38.6896 49.1950 79.8247
frequency: 38.5611 48.9698 79.8049 92.5990 99.0812 155.7575 172.0041 193.2876 206.4806 215.4473 236.9982 244.5876 256.9291 281.5785 287.5470 321.4481 335.5570 408.3416 416.3190 437.0693 474.9266 509.5549 546.5348 614.6965 629.1288 686.4792 736.6813 792.8329 838.4046 846.0095 871.1304 878.2331 905.8700 906.6964 921.4833 936.9979 949.2795 951.2994 970.0625 993.5905 1034.1603 1077.3371 1084.5265 1117.5092 1129.7471 1140.1810 1150.9116 1171.0552 1185.3821 1197.2988 1199.5845 1291.7635 1314.1848 1318.2891 1335.5521 1340.4428 1362.0484 1375.8461 1380.3655 1388.3420 1393.6161 1396.7705 1410.7703 1455.5220 1459.1517 1464.4062 1466.2876 1470.6205 1478.5716 1479.1312 1482.1652 1486.2259 1486.7221 1507.0942 2855.1337 2975.0267 2978.0326 2980.1727 2984.9144 2995.6696 3002.4410 3035.2498 3064.7926 3072.5683 3074.0060 3078.6251 3082.5189 3083.9141 3088.9640 3098.1915 3103.6353 3131.1448 3280.2663
redmass: 7.0141 3.2350 2.9031 3.4690 3.1780 2.2420 1.6809 1.4691 1.3339 2.3818 1.1563 3.0521 1.2111 2.3860 1.7296 1.8311 2.6564 2.7231 2.2207 3.3275 3.1330 2.9164 2.7241 3.6680 4.7703 3.1093 3.6594 1.4228 2.7104 6.5309 3.6244 3.9171 1.3516 8.1642 1.1850 1.2883 2.2776 1.4877 4.8615 1.9643 1.9648 2.0537 2.3800 2.2213 2.1233 2.3649 2.2769 2.0480 2.2558 2.0715 1.9836 1.4682 1.2771 1.3314 1.4038 1.2842 1.2935 1.2088 1.2168 1.2113 1.2038 1.2048 5.5821 1.1349 1.0495 1.0922 1.4452 1.0890 1.0491 1.4569 1.0468 1.1068 1.1829 1.0489 1.0811 1.0358 1.0362 1.0358 1.0366 1.0783 1.0404 1.0852 1.0980 1.0991 1.0995 1.0999 1.0988 1.0975 1.0998 1.0988 1.0994 1.0989 1.1009
irintensity: 4.7925 0.1411 0.7548 0.1382 0.8261 2.5114 0.9371 0.2235 1.6161 3.0432 0.0116 1.2206 0.1933 1.2056 0.5393 0.5700 0.6108 1.2022 0.6121 3.5116 4.9530 4.3361 7.0084 9.1041 1.8982 6.9729 8.2837 22.4139 1.3795 22.6984 0.8875 4.6030 4.7248 9.5349 4.7282 0.7054 3.3586 0.5553 37.5353 2.5060 10.4403 9.2947 17.2972 6.3777 16.4163 17.5136 44.0289 20.0450 53.7870 38.7201 27.9426 4.1193 3.6323 4.4107 2.2398 19.8818 8.0504 16.9926 21.8465 26.6280 39.6918 7.2896 11.3518 3.6432 1.8186 0.4764 23.6406 5.4545 19.0315 15.9179 4.5784 19.8498 5.6335 20.7452 61.2192 25.2068 24.6124 20.0583 32.7915 9.0342 24.1706 1.8544 11.3808 54.7215 5.6304 34.8018 81.9324 60.4413 25.0420 30.3725 14.6323 14.5916 2.0151
temp: 298.150 k
press: 1.00000 atm
elementType: 8 7 7 7 6 6 6 6 6 6 6 6 6 6 1 1 1 1 1 1 1 1 1 1 1 1 1 1 1 1 1 1 1
symmnumber: 1
zpe: 738605.0 jmol-1
zpe.correction: 0.281320 hartree
zpe.thermalcorrener: 0.297283 hartree
zpe.thermalcorrenthalpy: 0.298227 hartree
zpe.thermalcorrgfe: 0.238600 hartree
zpe.sumelectzpe: -630.748891 hartree
zpe.sumelectthermal: -630.732927 hartree
zpe.sumelectthermalent: -630.731983 hartree
zpe.sumelectthermalfe: -630.791610 hartree
dipole: 3.0478 -1.6247 -1.9378
dipole: 3.9603
quadrupole: -97.0214 -84.7359 -83.8190
quadrupole: 4.7571 6.0158 -1.2898
quadrupole: -8.4959 3.7895 4.7064 4.7571 6.0158 -1.2898
hfenergy: -631.0302103 hartree
pointgroup: C01 [X(C10H19N3O1)]
dipole: -0.4779638 1.3587017 -0.5943105 debye
polarizability: 135.8098785|-13.9751559|134.0440321|-6.2635108|-1.6428433|121.060257 unknown
InChI: InChI=1S/C10H19N3O/c1-7(2)13(8(3)4)9(5)10-12-11-6-14-10/h6-9H,1-5H3
charge 0 multiplicity 1
33 atoms
O  1.971512 -0.075767 -0.56071
N  -1.082094 0.253944 0.226051
N  1.728424 -1.950517 0.71746
N  2.845469 -2.151422 -0.191177
C  -1.311438 -0.73769 -0.880511
C  -1.302418 1.703762 -0.092125
C  0.085087 -0.004984 1.130784
C  -2.496535 -0.334605 -1.788866
C  -1.590744 -2.151247 -0.309369
C  -0.212435 2.351359 -0.99131
C  -1.53649 2.533523 1.192583
C  -0.312596 -0.70211 2.455308
C  1.240657 -0.733294 0.478251
C  2.938804 -1.038408 -0.904164
H  -0.408426 -0.80726 -1.538418
H  -2.255987 1.737049 -0.645981
H  0.4960 0.986766 1.403493
H  -2.686314 -1.154414 -2.504559
H  -3.415439 -0.185685 -1.191752
H  -2.302525 0.577183 -2.380531
H  -0.735956 -2.561263 0.251557
H  -1.80274 -2.849503 -1.14025
H  -2.471876 -2.118508 0.356989
H  -0.495103 3.388882 -1.251615
H  0.768037 2.384612 -0.482273
H  -0.079856 1.784683 -1.930771
H  -2.3087 2.056474 1.821055
H  -1.879821 3.549017 0.922314
H  -0.619627 2.655917 1.800161
H  -1.097843 -0.100196 2.941823
H  0.556057 -0.785624 3.133662
H  -0.707923 -1.713387 2.280357
H  3.645736 -0.796789 -1.691064
