program: Gaussian 09
title: 000036141
version: EM64L-G09RevD.01
frameworkgroup: C1[X(C8H20N3S)]
method: RPBEPBE
basis: SDD
operation: Freq
keyword: #p
keyword: freq=noraman
keyword: PBEPBE/SDD
title: #p freq=noraman PBEPBE/SDD
converged: YES YES NO NO
title: Mulliken charges:
elementType: S N N N C C C C C C C C H H H H H H H H H H H H H H H H H H H H
charge: 0.292691 -0.109950 0.048062 -0.332427 -0.290982 -0.551942 -0.546599 -0.564263 -0.758189 -0.483181 -0.302591 -0.681065 0.309948 0.274545 0.269074 0.263411 0.274057 0.270486 0.264580 0.269359 0.290408 0.268217 0.257901 0.291644 0.304442 0.262656 0.210234 0.208780 0.291728 0.222609 0.241551 0.234805
chargesum: 1.00000
title: Mulliken charges with hydrogens summed into heavy atoms:
elementType: S N N N C C C C C C C C
charge: 0.292691 -0.109950 0.048062 -0.040698 0.293512 0.254601 0.257826 0.252263 -0.162103 -0.220526 0.116423 0.017900
polarizability: 1.55766614e+02 1.10334818e+01 1.41816112e+02 -4.03806203e+00 4.03960547e+00 8.91098624e+01
1716.lowfreq: -8.6608 -0.0015 0.0013 0.0017 2.1240 7.1170 30.4182 38.0505 52.1861
frequency: 30.3962 38.0061 52.1547 63.5242 81.8343 119.6786 149.4302 168.0870 185.2707 206.1628 234.8273 245.6037 257.3043 267.4211 271.1944 340.8060 346.6919 352.8600 395.8464 433.9268 437.8604 466.2859 487.0606 542.4945 692.1484 729.0716 758.8498 785.3091 811.3921 818.6970 847.8540 916.8988 925.7699 943.7592 1016.2607 1042.6915 1047.9446 1056.4245 1107.0030 1113.4031 1117.0242 1161.7356 1180.3195 1186.4761 1218.3174 1246.0948 1249.8278 1257.7807 1274.1991 1286.5938 1322.5502 1343.0719 1360.5013 1402.5584 1420.3869 1425.1335 1427.2109 1439.2728 1451.9068 1463.6402 1465.9159 1468.0903 1470.5736 1478.7828 1483.7368 1487.6660 1488.2353 1496.8606 1499.5993 1549.3038 2926.0277 2992.9018 3011.6239 3023.8611 3026.5944 3028.0000 3032.3523 3043.2727 3076.6573 3087.9193 3105.0109 3106.7062 3129.3688 3139.2551 3141.6878 3144.6027 3146.2421 3151.3074 3154.5687 3427.3311
redmass: 2.6368 3.0952 2.0961 2.8957 2.2994 2.6098 2.9675 2.8825 1.5137 1.8791 1.5356 1.1522 1.8712 1.1741 4.2122 2.4042 2.6886 3.9066 3.4667 2.3280 2.6463 1.4939 2.6992 3.6859 5.4738 2.4122 1.7008 3.3572 1.1293 1.4347 3.4421 1.7740 2.6099 2.6412 1.4703 3.2198 1.2179 2.6227 1.3141 1.5560 1.9783 1.9708 1.2835 3.1582 1.6936 1.8280 1.1534 1.4396 1.2693 1.2414 1.2007 1.3309 1.2660 1.2235 1.1165 1.1362 1.1312 1.0911 1.0500 1.0859 1.0499 1.0931 1.1096 1.0553 1.0559 1.0785 1.1332 1.0909 1.0553 8.1514 1.0676 1.0383 1.0928 1.0322 1.0322 1.0415 1.0505 1.0563 1.0906 1.0989 1.1081 1.1004 1.1089 1.1056 1.1057 1.1050 1.1056 1.1051 1.1046 1.0761
irintensity: 0.1296 2.6456 0.6278 0.2149 2.1706 2.8961 8.2466 42.8322 3.1540 2.9072 2.0856 1.5457 1.1289 1.5047 7.5751 0.5200 0.4469 3.1714 32.0838 0.6223 0.6946 75.4669 2.0294 14.4796 2.0208 5.2237 2.1511 39.6731 24.8985 40.1856 56.9296 7.2994 8.1090 17.7078 10.3451 6.4294 0.1517 6.8214 6.0614 4.1182 29.2614 13.2156 0.3129 92.1083 0.8595 0.0116 0.8175 6.3474 5.7920 26.6302 4.5452 12.4934 4.5165 25.9390 4.0257 21.5777 15.5508 6.1809 0.8037 5.1689 8.6700 10.4180 21.0575 24.9699 37.5195 27.1962 21.1693 22.0993 87.5854 6.9525 82.1946 17.1618 37.6706 2.6127 2.3285 2.0274 14.1828 11.9976 24.8490 35.1639 0.1138 22.7873 1.1370 0.5979 1.2524 2.7780 7.9858 1.4886 7.2933 3.9078
temp: 298.150 k
press: 1.00000 atm
elementType: 16 7 7 7 6 6 6 6 6 6 6 6 1 1 1 1 1 1 1 1 1 1 1 1 1 1 1 1 1 1 1 1
symmnumber: 1
zpe: 740529.5 jmol-1
zpe.correction: 0.282053 hartree
zpe.thermalcorrener: 0.298365 hartree
zpe.thermalcorrenthalpy: 0.299309 hartree
zpe.thermalcorrgfe: 0.237360 hartree
zpe.sumelectzpe: -877.862074 hartree
zpe.sumelectthermal: -877.845763 hartree
zpe.sumelectthermalent: -877.844818 hartree
zpe.sumelectthermalfe: -877.906767 hartree
dipole: 6.1177 -5.2327 0.6139
dipole: 8.0737
quadrupole: -33.4865 -68.6286 -76.7571
quadrupole: -10.3447 -3.2969 0.2288
quadrupole: 26.1376 -9.0045 -17.1331 -10.3447 -3.2969 0.2288
hfenergy: -878.1441272 hartree
pointgroup: C01 [X(C8H20N3S1)]
dipole: -2.5543801 -1.1220428 1.5185193 debye
polarizability: 154.0929174|-5.4859159|95.0224252|10.4890513|-17.9265361|137.5772451 unknown
InChI: InChI=1S/C8H20N3S/c1-5-9-10-8-12-7-6-11(2,3)4/h8-9H,5-7H2,1-4H3
charge 1 multiplicity 1
32 atoms
S  -0.178264 1.548621 -3.070829
N  -2.507364 -0.017734 0.10323
N  1.445296 0.779098 -0.972604
N  2.647578 0.555115 -0.34782
C  -1.698986 0.152628 -1.221449
C  -3.840703 0.718546 0.023447
C  -2.769254 -1.511348 0.294701
C  -1.696351 0.501517 1.290576
C  -1.308583 1.595167 -1.562521
C  1.394983 1.096169 -2.240782
C  2.631008 -0.082367 0.976946
C  4.03806 -0.054251 1.59685
H  -0.783479 -0.447683 -1.090293
H  -2.320544 -0.288369 -2.01967
H  -4.41617 0.330292 -0.830839
H  -4.399124 0.550723 0.95747
H  -3.657775 1.794672 -0.106451
H  -1.805696 -2.034271 0.39125
H  -3.369712 -1.660818 1.205344
H  -3.314903 -1.897033 -0.579948
H  -0.677966 0.088909 1.232269
H  -1.648228 1.598726 1.250576
H  -2.191436 0.186295 2.222088
H  -2.159288 2.227901 -1.859521
H  -0.723491 2.072918 -0.761277
H  2.250991 1.172518 -2.927954
H  1.92553 0.481015 1.617657
H  2.268979 -1.133142 0.914082
H  3.507071 0.478197 -0.908653
H  4.764138 -0.615525 0.979592
H  4.401089 0.981859 1.708288
H  4.021896 -0.524346 2.594747
