program: Gaussian 09
title: 000036128
version: EM64L-G09RevD.01
frameworkgroup: C1[X(C10H17N3O)]
method: RPBEPBE
basis: SDD
operation: Freq
keyword: #p
keyword: freq=noraman
keyword: PBEPBE/SDD
title: #p freq=noraman PBEPBE/SDD
converged: YES YES NO NO
title: Mulliken charges:
elementType: O N N N C C C C C C C C C C H H H H H H H H H H H H H H H H H
charge: -0.224050 -0.104651 -0.133438 -0.091039 0.017922 -0.370760 -0.371810 -0.394524 -0.391340 -0.401950 -0.495830 -0.773766 0.189344 -0.145064 0.228206 0.183998 0.206681 0.228266 0.169729 0.204807 0.193624 0.192998 0.202512 0.215971 0.190733 0.250105 0.247728 0.237835 0.219278 0.240022 0.278462
chargesum: 0.00000
title: Mulliken charges with hydrogens summed into heavy atoms:
elementType: O N N N C C C C C C C C C C
charge: -0.224050 -0.104651 -0.133438 -0.091039 0.246128 0.019919 0.026185 0.003907 0.004170 0.004754 0.002004 -0.076632 0.189344 0.133398
polarizability: 1.74308625e+02 -2.82249503e+00 1.09458183e+02 1.09421499e+00 4.78692980e+00 1.02060468e+02
1716.lowfreq: -23.8262 -3.1892 0.0005 0.0005 0.0007 7.3751 8.4585 33.3778 48.2725
frequency: 6.4269 32.4635 48.0693 84.7518 112.7186 182.0970 232.4573 261.4870 269.7777 292.9245 310.8959 353.1843 377.1119 396.5436 442.2056 451.4803 475.0223 554.9647 620.2524 652.1646 708.7400 767.3236 790.8107 805.7479 831.0598 842.6906 851.7783 866.4037 876.6344 893.0101 911.9964 913.7392 950.2577 958.2411 978.6630 1020.4539 1047.7314 1061.8114 1068.3790 1112.3310 1115.9608 1130.1513 1147.6661 1152.0190 1162.7692 1191.9139 1232.8787 1246.2449 1259.3938 1268.9692 1292.1081 1294.8376 1327.0078 1332.5090 1339.2650 1344.8369 1351.6471 1356.0488 1386.7740 1393.2655 1410.1557 1445.6340 1451.4001 1459.5029 1465.2094 1467.8077 1475.8492 1480.4030 1490.3652 1502.2812 2826.3804 2839.4282 2882.3730 2968.7287 2984.2805 2985.6536 2985.9551 3025.6784 3031.8943 3036.6047 3044.4781 3054.2856 3065.4534 3078.7373 3090.0768 3093.6947 3282.2779
redmass: 6.3988 4.1283 3.5657 3.0823 4.2577 3.2809 2.2670 2.2565 3.2575 2.6660 1.2996 2.2054 1.8865 2.8921 2.7110 2.5088 2.5549 1.8729 4.3483 5.8868 3.7711 3.4304 1.4568 1.4667 3.0455 2.9688 1.4700 4.6891 3.0287 3.1554 2.3836 3.8691 2.0303 1.4221 6.2314 2.1114 2.0410 1.9356 1.7751 2.6569 2.0544 2.0158 1.3290 1.8352 2.2451 1.4558 2.1184 1.4082 1.2533 1.1894 1.3665 1.4639 1.3227 1.2794 1.3883 1.4819 1.4433 1.4113 1.3779 1.2398 5.2478 1.1075 1.0908 1.0883 1.0757 1.0930 1.0702 1.0798 1.0530 9.7069 1.0719 1.0711 1.0825 1.0626 1.0603 1.0393 1.0590 1.0599 1.0905 1.0922 1.1030 1.1029 1.0893 1.0981 1.1004 1.0998 1.1008
irintensity: 5.8135 1.4515 0.3360 0.3700 1.1161 1.2027 0.5973 1.0657 3.4859 0.2587 0.8184 4.2306 2.1854 3.0795 1.3031 4.3640 0.3958 0.1727 11.3349 5.7083 5.3434 5.8085 24.9507 0.0405 9.1075 0.8388 6.8098 17.8614 5.2608 16.9445 2.9191 7.3190 29.3150 8.5086 26.1422 3.7288 9.6836 5.6672 9.5633 22.2957 4.7530 21.1167 4.7134 13.3569 56.6509 25.7363 28.7515 8.7227 1.3861 8.8259 8.2392 2.7252 37.1014 4.6132 10.5349 4.0601 2.3715 4.0446 0.8036 24.3274 20.8513 11.8018 6.2426 13.3747 8.9960 9.4740 6.4378 5.4155 5.6345 71.3683 64.3255 112.5462 55.0652 37.3735 45.9038 25.6599 17.8539 8.3438 85.9993 38.9427 25.8383 80.8548 34.8837 37.2478 17.4018 20.2782 2.4281
temp: 298.150 k
press: 1.00000 atm
elementType: 8 7 7 7 6 6 6 6 6 6 6 6 6 6 1 1 1 1 1 1 1 1 1 1 1 1 1 1 1 1 1
symmnumber: 1
zpe: 691834.3 jmol-1
zpe.correction: 0.263506 hartree
zpe.thermalcorrener: 0.277008 hartree
zpe.thermalcorrenthalpy: 0.277952 hartree
zpe.thermalcorrgfe: 0.220480 hartree
zpe.sumelectzpe: -629.583430 hartree
zpe.sumelectthermal: -629.569928 hartree
zpe.sumelectthermalent: -629.568984 hartree
zpe.sumelectthermalfe: -629.626456 hartree
dipole: 2.0273 1.7709 1.8694
dipole: 3.2773
quadrupole: -83.8336 -84.7888 -89.9389
quadrupole: -7.5186 -11.4175 -3.9374
quadrupole: 2.3535 1.3983 -3.7518 -7.5186 -11.4175 -3.9374
hfenergy: -629.846936 hartree
pointgroup: C01 [X(C10H17N3O1)]
dipole: -0.8245755 -0.5888316 0.7974076 debye
polarizability: 174.2807379|-2.6508872|107.9866423|1.7510124|-5.7165386|103.5598958 unknown
InChI: InChI=1S/C10H17N3O/c1-9(7-10-12-11-8-14-10)13-5-3-2-4-6-13/h8-9H,2-7H2,1H3
charge 0 multiplicity 1
31 atoms
O  3.207231 -0.147008 1.231767
N  -1.536161 -0.144244 0.099222
N  2.784428 0.78402 -0.810142
N  4.213309 0.533917 -0.701358
C  -0.111224 -0.460209 -0.222328
C  -1.964653 1.140952 -0.521408
C  -2.532994 -1.211599 -0.181465
C  -3.328918 1.60632 0.023767
C  -3.919933 -0.823515 0.377018
C  -4.402503 0.520897 -0.20934
C  0.795803 0.382285 0.741627
C  0.247639 -1.952656 -0.081616
C  2.23016 0.378196 0.331811
C  4.399754 -0.001365 0.496825
H  0.132995 -0.146134 -1.266991
H  -2.031057 1.034493 -1.636364
H  -1.201384 1.914999 -0.322604
H  -2.204657 -2.150487 0.292909
H  -2.628039 -1.405361 -1.283164
H  -3.231358 1.806482 1.108304
H  -3.615944 2.554715 -0.469846
H  -4.640738 -1.632402 0.14849
H  -3.844851 -0.740985 1.478803
H  -5.366312 0.820139 0.243887
H  -4.578238 0.405969 -1.29919
H  0.700015 -0.021167 1.763571
H  0.434494 1.425274 0.762514
H  -0.282687 -2.57841 -0.819016
H  0.016887 -2.3269 0.932851
H  1.330078 -2.087512 -0.255867
H  5.327758 -0.325404 0.956134
