program: Gaussian 09
title: 000036135
version: EM64L-G09RevD.01
frameworkgroup: C1[X(C15H23N3O)]
method: RPBEPBE
basis: SDD
operation: Freq
keyword: #p
keyword: freq=noraman
keyword: PBEPBE/SDD
title: #p freq=noraman PBEPBE/SDD
converged: YES YES NO NO
title: Mulliken charges:
elementType: O N N N C C C C C C C C C C C C C C C H H H H H H H H H H H H H H H H H H H H H H H
charge: -0.274980 -0.295252 -0.365731 -0.308411 -0.267732 -0.559078 0.316154 -0.562616 0.235103 0.215926 -0.399046 -0.397780 -0.364386 -0.341133 -0.024184 -0.242322 -0.246917 -0.671084 -0.713785 0.223731 0.214143 0.257020 0.234475 0.228096 0.289464 0.231898 0.237996 0.236514 0.300329 0.227603 0.195678 0.216803 0.183612 0.251129 0.226022 0.225927 0.205675 0.223000 0.210110 0.208825 0.213697 0.225509
chargesum: 0.00000
title: Mulliken charges with hydrogens summed into heavy atoms:
elementType: O N N N C C C C C C C C C C C C C C C
charge: -0.274980 -0.005789 -0.065403 -0.057281 -0.044001 -0.087915 0.316154 -0.100045 0.235103 0.215926 -0.167149 0.076730 -0.136782 0.071348 0.159427 -0.016300 -0.020990 -0.032299 -0.065754
polarizability: 2.50067792e+02 -4.26168322e+00 1.73682737e+02 3.40655597e+00 2.21245758e+00 1.29706236e+02
1716.lowfreq: -7.2791 -2.0479 -0.0005 0.0004 0.0011 5.7862 10.6390 21.9121 24.0447
frequency: 10.2453 21.8260 22.4500 40.1568 50.2755 71.5179 103.2098 123.6761 142.3807 153.8484 180.2945 201.3072 212.6292 242.5211 247.8112 270.5348 296.7714 331.7094 346.6399 364.4340 419.9822 427.7725 443.3967 448.8401 486.1598 505.2401 542.1743 560.1368 578.1444 615.7402 666.4690 675.9220 699.7120 717.8367 720.3419 745.8372 753.1034 799.9346 824.3336 851.9811 857.3005 880.2318 916.6150 919.0691 943.4371 948.1035 954.4306 965.2009 984.2956 1012.9587 1035.6039 1042.1122 1062.2566 1081.6528 1092.7246 1100.2086 1108.1584 1134.8512 1148.8781 1166.8984 1172.6701 1174.6833 1185.6247 1195.4916 1202.0908 1209.9163 1217.4636 1249.3373 1261.8629 1288.8645 1299.4682 1304.1080 1311.7173 1329.7828 1336.8043 1339.5051 1351.6150 1371.6033 1385.3657 1385.7011 1387.9937 1436.9692 1441.9178 1448.9548 1451.5131 1452.0048 1455.1073 1465.5819 1471.7972 1478.2471 1486.7980 1486.9362 1493.7475 1497.1319 1591.5317 1613.3852 1617.0973 2850.0947 2886.6383 2943.8774 2966.5234 2972.6848 2973.9346 2981.7047 3010.5604 3019.4861 3024.2001 3031.4889 3066.3209 3075.9365 3080.7823 3084.8361 3090.5668 3105.7368 3113.1009 3134.5280 3157.4360 3415.2694 3445.8224 3558.5468
redmass: 3.5034 3.4444 4.1168 4.3292 3.8672 2.7925 2.2309 2.9220 3.5981 3.1180 2.5539 1.3671 3.8025 1.1601 2.3229 2.8550 4.4240 3.5770 3.1265 3.0064 2.7493 2.6970 4.1843 2.4963 3.0402 2.9934 1.5452 2.1181 4.6296 3.5574 1.7886 1.4408 4.2319 3.2482 2.6753 2.4303 1.5964 1.6606 2.4462 2.2840 2.0188 1.7382 1.1794 1.7495 1.7018 2.0110 1.7057 1.8614 1.3234 3.7906 2.4323 3.6581 2.6182 2.2105 2.5535 2.0164 2.0578 3.6632 2.2952 1.9486 1.0667 1.2297 1.8038 2.2968 1.6316 2.0699 1.4062 1.5215 1.3797 1.1678 1.4698 1.2822 1.2551 1.4050 1.4214 1.3350 1.5982 1.2460 4.3583 1.4083 1.2223 2.1090 1.2013 1.1149 1.1672 1.1107 1.1437 1.0621 1.1041 1.1344 1.1127 2.0712 1.3712 1.3843 6.6301 6.4274 5.9293 1.0821 1.0703 1.0682 1.0618 1.0820 1.0362 1.0355 1.0632 1.0844 1.1011 1.0931 1.0986 1.0986 1.1051 1.1003 1.0996 1.0873 1.0884 1.0924 1.1004 1.0739 1.0748 1.0779
irintensity: 0.1066 0.4431 1.8484 3.5509 1.9951 0.1157 1.5343 1.3456 6.1045 3.5066 4.0629 2.4066 0.5294 1.4368 6.6048 7.0626 3.2655 1.7221 10.7364 1.0344 4.0361 9.9948 1.6440 19.8383 1.0476 6.2663 55.2097 52.3812 4.2924 7.2949 212.0951 34.3527 2.1669 13.3850 4.6160 32.0451 54.9099 5.8151 5.3780 5.4639 1.0612 2.7632 3.8322 7.0687 0.4410 0.3941 1.1603 9.2039 0.1345 4.0030 4.8156 8.8684 5.0160 0.7027 12.9357 1.4546 5.7797 15.3525 26.2388 2.2203 0.1877 3.6975 37.1854 6.7399 55.9550 4.3876 51.1437 30.7600 14.8346 3.3516 17.6878 3.8376 3.6004 9.3804 18.6401 27.3456 18.0087 27.0792 1.5745 9.4794 18.0257 7.8741 61.9979 5.1689 11.5770 28.2774 2.3590 5.0335 5.9400 0.9973 1.5103 42.0041 119.0140 130.4237 3.7332 3.5355 138.9687 81.1795 90.6420 48.4347 19.5254 31.5686 36.2476 19.1092 32.5888 28.9344 30.0281 21.7657 34.7418 51.9894 20.0873 11.3301 65.8242 16.0647 3.7953 29.2818 38.2385 1.9806 9.1298 18.6501
temp: 298.150 k
press: 1.00000 atm
elementType: 8 7 7 7 6 6 6 6 6 6 6 6 6 6 6 6 6 6 6 1 1 1 1 1 1 1 1 1 1 1 1 1 1 1 1 1 1 1 1 1 1 1
symmnumber: 1
zpe: 945724.3 jmol-1
zpe.correction: 0.360207 hartree
zpe.thermalcorrener: 0.379911 hartree
zpe.thermalcorrenthalpy: 0.380856 hartree
zpe.thermalcorrgfe: 0.308363 hartree
zpe.sumelectzpe: -823.418408 hartree
zpe.sumelectthermal: -823.398704 hartree
zpe.sumelectthermalent: -823.397760 hartree
zpe.sumelectthermalfe: -823.470253 hartree
dipole: 0.4100 1.6396 -2.0632
dipole: 2.6670
quadrupole: -104.6416 -114.8000 -116.8397
quadrupole: 3.9763 2.0016 2.1258
quadrupole: 7.4522 -2.7063 -4.7459 3.9763 2.0016 2.1258
hfenergy: -823.7786156 hartree
pointgroup: C01 [X(C15H23N3O1)]
dipole: -0.136456 0.7037804 0.7662189 debye
polarizability: 250.2923924|2.3705191|172.9808909|2.0259803|-5.3276339|130.1834821 unknown
InChI: InChI=1S/C15H23N3O/c1-11(2)16-7-8-17-15(19)14-9-12-5-3-4-6-13(12)10-18-14/h3-6,11,14,16-18H,7-10H2,1-2H3
charge 0 multiplicity 1
42 atoms
O  -0.728398 -1.262131 -1.270153
N  1.789772 -1.893775 0.00219
N  -1.399548 -0.815303 0.914531
N  -4.994173 -0.065985 -0.011584
C  1.011154 -0.680735 0.343685
C  1.554976 0.581884 -0.388861
C  3.068851 0.706487 -0.247431
C  3.21979 -1.788922 0.349783
C  3.86775 -0.426002 0.071457
C  -0.443741 -0.943318 -0.072082
C  3.701714 1.959578 -0.453647
C  -2.830016 -1.041171 0.651619
C  5.273181 -0.280106 0.174507
C  -3.584962 0.258398 0.28816
C  -5.892244 1.086796 -0.30159
C  5.102522 2.096321 -0.357136
C  5.895713 0.967167 -0.043123
C  -6.199169 1.880154 0.987903
C  -7.191585 0.545897 -0.932167
H  1.087079 -0.527217 1.44003
H  1.061162 1.499413 -0.011897
H  1.278332 0.485793 -1.458474
H  3.764756 -2.584823 -0.191065
H  3.340748 -2.015478 1.430724
H  1.61569 -2.156283 -0.978127
H  3.083995 2.834297 -0.694664
H  -2.89285 -1.751756 -0.193193
H  -3.30277 -1.506987 1.534142
H  -1.100218 -0.579666 1.8616
H  5.886052 -1.156168 0.425499
H  -3.553971 0.952797 1.14878
H  -3.051755 0.756877 -0.557845
H  -5.415297 1.78801 -1.033687
H  -5.048028 -0.761213 -0.770906
H  5.572618 3.072013 -0.523889
H  6.985132 1.060233 0.030474
H  -6.877374 2.725191 0.767862
H  -6.682396 1.217777 1.728506
H  -5.283744 2.298561 1.444117
H  -6.986224 0.006038 -1.876822
H  -7.889738 1.370499 -1.16057
H  -7.688383 -0.153043 -0.234654
