program: Gaussian 09
title: 000036111
version: EM64L-G09RevD.01
frameworkgroup: C1[X(C12H16)]
method: RPBEPBE
basis: SDD
operation: Freq
keyword: #p
keyword: freq=noraman
keyword: PBEPBE/SDD
title: #p freq=noraman PBEPBE/SDD
converged: YES YES NO NO
title: Mulliken charges:
elementType: C C C C C C C C C C C C H H H H H H H H H H H H H H H H
charge: 0.008036 -0.458238 -0.597427 -0.564787 -0.402258 0.289524 0.286166 -0.718789 -0.396968 -0.397170 -0.251992 -0.249568 0.204369 0.202075 0.208236 0.212432 0.229438 0.219620 0.221030 0.195396 0.200413 0.225041 0.211701 0.215220 0.230792 0.229261 0.224132 0.224315
chargesum: 0.00000
title: Mulliken charges with hydrogens summed into heavy atoms:
elementType: C C C C C C C C C C C C
charge: 0.212405 -0.047927 -0.155557 -0.124138 -0.006449 0.289524 0.286166 -0.066827 -0.166176 -0.167909 -0.027860 -0.025252
polarizability: 1.59499937e+02 2.07678606e+00 1.29473174e+02 2.97820552e+00 -3.63454089e+00 7.75983543e+01
1716.lowfreq: -18.3737 -1.7686 -0.0004 0.0004 0.0004 6.0534 62.5216 81.5904 132.7899
frequency: 62.5167 81.5592 132.7881 169.8041 188.7214 251.5954 254.2805 306.2003 358.9292 419.5884 430.7457 447.1155 459.0173 505.8255 578.8047 609.6145 707.9851 723.3057 747.1376 766.6242 813.5119 832.6017 870.2000 889.7163 908.6614 929.9500 954.5475 983.9936 993.7897 1013.7922 1034.7892 1062.0065 1079.6366 1104.4353 1125.9627 1135.2113 1147.9651 1172.4082 1194.8416 1209.0660 1220.8440 1232.9339 1252.1060 1278.8091 1289.9203 1304.7057 1332.0866 1340.4248 1349.3893 1360.7989 1381.5090 1390.8319 1438.9877 1450.0543 1456.2710 1462.6658 1472.6895 1478.9456 1488.2642 1490.1358 1590.8428 1613.3585 2936.9579 2949.0355 2955.4132 2957.7261 2970.5235 2976.5200 3009.1446 3015.6570 3018.9066 3033.6111 3068.6976 3076.1423 3106.4112 3110.5985 3133.0571 3156.0712
redmass: 3.3001 2.0879 2.4483 2.8255 1.6007 1.3927 2.4934 3.3515 3.6353 2.3038 2.5942 2.6200 3.1183 3.4878 3.7443 4.0296 3.1690 3.7867 1.2632 1.2890 1.6061 3.5187 1.3711 1.5362 2.2244 1.8253 1.4256 1.3200 1.8699 1.9984 2.5244 1.9654 2.4214 1.7791 1.8562 1.3931 1.6203 1.0628 2.4695 1.5809 1.6036 1.3513 1.4194 1.3131 1.1799 1.4028 1.4182 1.5016 1.4858 1.7986 5.0242 1.2175 2.3712 1.1462 1.0942 1.0831 1.0839 1.0611 1.1346 1.9545 6.5470 6.4212 1.0708 1.0741 1.0640 1.0616 1.0628 1.0365 1.0998 1.0939 1.0952 1.1021 1.0993 1.0993 1.0863 1.0891 1.0924 1.1004
irintensity: 0.0562 0.0519 0.0702 0.0649 0.0923 0.4720 6.6017 0.3017 0.5448 2.4619 4.0741 1.4234 0.2228 0.2624 0.1871 2.2152 0.4728 1.7050 67.4564 8.7016 6.8691 5.2522 1.5777 5.2248 3.8138 6.4224 4.7607 0.0146 4.4204 1.9698 3.8154 5.9063 4.2894 4.1817 2.6072 1.6100 0.0670 0.0269 0.7276 1.0712 0.9972 1.0018 4.9640 2.0096 1.2899 1.3706 1.6983 1.4241 1.0700 0.2297 1.3141 16.1995 5.0733 2.8795 16.9717 0.5320 11.0810 12.6817 7.1178 26.1379 3.7131 0.8166 11.4517 17.7141 28.2891 22.9797 72.6857 29.9556 13.7397 57.5633 10.5253 79.4204 54.6767 63.1192 18.8019 2.1441 31.4004 37.1355
temp: 298.150 k
press: 1.00000 atm
elementType: 6 6 6 6 6 6 6 6 6 6 6 6 1 1 1 1 1 1 1 1 1 1 1 1 1 1 1 1
symmnumber: 1
zpe: 644848.8 jmol-1
zpe.correction: 0.245610 hartree
zpe.thermalcorrener: 0.256579 hartree
zpe.thermalcorrenthalpy: 0.257524 hartree
zpe.thermalcorrgfe: 0.209063 hartree
zpe.sumelectzpe: -465.987835 hartree
zpe.sumelectthermal: -465.976865 hartree
zpe.sumelectthermalent: -465.975921 hartree
zpe.sumelectthermalfe: -466.024382 hartree
dipole: 0.8228 0.3101 -0.0221
dipole: 0.8795
quadrupole: -70.4458 -68.7874 -76.2468
quadrupole: -0.0756 0.4181 -1.1220
quadrupole: 1.3809 3.0392 -4.4201 -0.0756 0.4181 -1.1220
hfenergy: -466.2334448 hartree
pointgroup: C01 [X(C12H16)]
dipole: -0.3271165 -0.1123501 -0.0105873 debye
polarizability: 159.6244768|1.1687304|129.3649794|-2.4355666|3.8070388|77.5820089 unknown
InChI: InChI=1S/C12H16/c1-2-10-7-8-11-5-3-4-6-12(11)9-10/h3-6,10H,2,7-9H2,1H3
charge 0 multiplicity 1
28 atoms
C  -1.882666 -0.24736 -0.200825
C  -1.390278 -1.59467 0.381162
C  -0.927988 0.878702 0.264532
C  0.008686 -1.955366 -0.161227
C  -3.354886 0.030785 0.192251
C  0.554182 0.541509 0.108154
C  1.000889 -0.798965 -0.063913
C  -3.957593 1.308495 -0.43273
C  1.514141 1.585254 0.157704
C  2.392076 -1.054753 -0.172213
C  2.895465 1.322556 0.04729
C  3.339057 -0.010863 -0.118037
H  -1.827795 -0.317243 -1.30978
H  -2.107188 -2.401551 0.132418
H  -1.358523 -1.518184 1.487822
H  -1.137835 1.089113 1.336435
H  -1.144967 1.81832 -0.278384
H  -0.086678 -2.255307 -1.22631
H  0.413928 -2.838335 0.370199
H  -3.425474 0.089919 1.298992
H  -3.968804 -0.842046 -0.110889
H  -3.448985 2.221209 -0.073004
H  -3.871808 1.287498 -1.535875
H  -5.029468 1.405452 -0.179997
H  1.167226 2.61911 0.28499
H  2.733182 -2.090389 -0.300735
H  3.618178 2.145342 0.088453
H  4.409124 -0.231735 -0.202783
