program: Gaussian 09
title: 000000682
version: EM64L-G09RevD.01
frameworkgroup: C1[X(C9H9NO4)]
method: RPBEPBE
basis: SDD
operation: Freq
keyword: #pfreq=noraman
keyword: PBEPBE/SDD
title: #p freq=noraman PBEPBE/SDD
converged: YES YES NO NO
title: Mulliken charges:
elementType: O O O O N C C C C C C C C C H H H H H H H H H
charge: -0.403970 -0.227952 -0.165713 -0.150980 -0.586019 -0.596052 -0.165650 0.558270 -0.508659 -0.282256 0.190550 0.085772 -0.289524 0.055348 0.243421 0.225516 0.264411 0.272985 0.233155 0.287433 0.310124 0.262196 0.387593
chargesum: 0.00000
title: Mulliken charges with hydrogens summed into heavy atoms:
elementType: O O O O N C C C C C C C C C
charge: -0.016377 -0.227952 -0.165713 -0.150980 0.011538 -0.127115 0.098761 0.558270 -0.235674 -0.049100 0.190550 0.085772 -0.027328 0.055348
polarizability: 2.07677180e+02 2.24995807e+01 1.14742914e+02 1.58682505e+01 -1.29576180e+01 8.10684291e+01
1716.lowfreq: -8.3605 -4.7329 -0.0011 -0.0011 -0.0009 5.0580 28.7381 34.6685 44.9926
frequency: 28.6373 34.6277 44.9467 59.9833 97.1158 151.9523 226.3535 231.6304 271.7648 296.1348 312.3365 319.7789 336.2290 415.3768 455.1208 461.0102 467.1255 527.1115 573.8847 577.2328 599.7075 624.0520 657.3491 722.3371 758.8239 766.8741 782.3665 823.7630 894.8119 901.5031 935.8375 965.6603 996.3965 1058.2003 1100.2122 1107.2540 1134.1336 1162.4228 1183.2010 1190.0086 1258.6767 1260.6364 1274.2890 1312.8921 1327.2391 1397.9301 1401.3933 1462.7324 1538.1883 1571.4579 1577.9830 1608.4414 1632.7139 1671.8761 2994.1225 3048.5390 3074.1195 3115.4175 3139.4259 3159.8982 3501.5122 3503.0214 3647.1547
redmass: 6.7810 9.5403 7.7448 6.4218 4.9440 5.9906 1.7597 4.5014 3.2578 2.2150 3.7363 2.6191 8.0404 5.6809 2.4933 3.1369 2.0855 4.6248 4.9313 3.2292 3.3389 1.5553 4.6004 4.2837 2.5807 3.5310 2.7527 2.0240 2.2241 3.0329 3.2859 1.9398 1.3192 2.5437 1.5724 2.4281 1.4365 2.4554 1.4017 1.9851 2.5030 1.7574 1.3543 1.3877 1.3461 2.1682 1.9485 1.1124 9.5785 8.6499 10.8950 1.2649 6.0625 4.3583 1.0611 1.0879 1.1010 1.0883 1.0927 1.0973 1.0601 1.0486 1.1009
irintensity: 0.3695 2.4539 2.1299 0.5287 0.4442 2.3811 49.5637 13.1277 27.9927 39.5581 5.0271 2.8321 2.6687 21.6831 90.0608 10.2054 218.8315 52.6808 4.3351 1.1802 9.6511 177.3012 25.7815 35.0895 1.0187 5.2966 0.2003 33.9814 30.1706 2.1388 115.7765 18.1436 0.8542 202.4645 18.1724 24.6567 20.8800 5.8029 21.3428 3.9750 59.0283 24.9153 17.5872 8.4131 0.4625 22.2640 15.5232 12.2021 338.2631 24.8112 44.6089 166.3372 25.5776 138.4860 25.1974 9.2488 15.5954 10.4630 2.9954 6.5767 20.8329 76.2334 17.4074
temp: 298.150 k
press: 1.00000 atm
elementType: 8 8 8 8 7 6 6 6 6 6 6 6 6 6 1 1 1 1 1 1 1 1 1
symmnumber: 1
zpe: 441020.8 jmol-1
zpe.correction: 0.167976 hartree
zpe.thermalcorrener: 0.181668 hartree
zpe.thermalcorrenthalpy: 0.182612 hartree
zpe.thermalcorrgfe: 0.125709 hartree
zpe.sumelectzpe: -702.934289 hartree
zpe.sumelectthermal: -702.920597 hartree
zpe.sumelectthermalent: -702.919653 hartree
zpe.sumelectthermalfe: -702.976555 hartree
dipole: -5.5070 -4.7261 -0.4816
dipole: 7.2729
quadrupole: -105.4371 -77.2730 -77.9358
quadrupole: -0.9233 4.0916 5.7740
quadrupole: -18.5551 9.6090 8.9461 -0.9233 4.0916 5.7740
hfenergy: -703.1022647 hartree
pointgroup: C01 [X(C9H9N1O4)]
dipole: 2.0770352 1.9664593 -0.0809992 debye
dipolederiv: -0.5011195 -0.01747 0.3398734 0.0275686 -0.2139071 0.2144874 0.1695295 0.0822778 -0.9266686 -0.4947075 0.0783875 0.2358386 0.4285262 -0.673578 -0.1362335 0.1726956 0.007447 -0.5711898 -0.6984322 -0.2460005 -0.0737476 -0.4923877 -0.700416 -0.1436048 -0.1523686 -0.1252179 -0.351668 -0.8510708 -0.0461968 0.1641918 -0.0895932 -0.3236868 0.02311 0.229423 0.0084513 -0.3531472 -1.3569293 -0.1792776 -0.254429 -0.1885968 -0.3039589 0.0791134 -0.2711048 0.0282938 -0.6025627 -0.805431 -0.2719158 -0.052657 0.1273221 0.067931 0.045877 -0.4912439 -0.1558111 0.0154917 1.1577612 0.2530459 0.1260892 0.1883079 0.0336466 0.0689394 0.606573 0.1827898 0.3068787 0.8041129 0.1339884 -0.0744436 0.3798163 0.1161213 0.0840932 -0.2836641 0.0267361 0.0105993 -0.7930077 -0.3721036 -0.1382989 -0.4089029 -0.2706817 -0.0206374 0.1899679 0.1195354 -0.0809354 0.0528204 0.0740565 0.0072586 0.0110581 0.2213559 0.1475044 -0.0334834 0.1587657 0.0038369 0.5679719 -0.0737438 -0.6379215 -0.6501597 0.8727087 -0.1450246 -0.4502326 -0.1000975 1.053615 1.1205911 0.551863 0.1029883 0.5240225 0.5556096 0.0987412 -0.0022874 -0.0389689 0.217469 -0.3124867 -0.0493448 0.0409266 -0.2818386 -0.1105496 0.1269021 -0.0963796 0.0362627 -0.0723476 0.8852182 0.1621196 -0.1460048 0.3498949 0.3718502 -0.0870661 -0.1640243 0.0138593 0.2066647 0.0040916 -0.0007122 0.0359686 0.0262196 0.0142641 -0.1120888 0.0532353 -0.0310505 -0.0189368 0.0378011 -0.0060954 -0.0047875 -0.0470618 -0.1125529 0.068827 0.0697673 0.0748195 0.0699243 0.054094 0.028315 0.0520731 0.0461758 0.01559 -0.0664298 -0.0419268 -0.0757418 -0.0484404 0.019703 0.014046 0.0735165 0.0449656 0.0539248 -0.0652362 0.0641375 -0.0607723 0.0823225 0.0497238 -0.114987 -0.0158243 -0.0705783 -0.0228619 -0.0542749 0.0275328 -0.0387584 0.0950151 0.3362263 0.0667743 0.0762729 0.1045623 0.1062836 0.0403043 0.2030523 0.123997 0.2888311 0.3500389 -0.0291311 0.0450581 -0.1016135 0.16473 -0.0989048 0.1000417 -0.0846814 0.2236975 0.0534898 0.0358397 0.0632233 0.0213264 0.0326838 -0.0758641 0.0457548 -0.0940972 0.0918995 0.3195404 0.0085427 0.0348353 0.0509661 0.1054932 0.0074657 0.0550045 -0.0580383 0.3596512 unknown
polarizability: 204.9637811|27.9961762|115.1542106|-16.2349401|14.2072991|83.370531 unknown
InChI: InChI=1S/C9H9NO4/c10-6(9(13)14)3-5-1-2-7(11)8(12)4-5/h1-2,4,6,13H,3,10H2
charge 0 multiplicity 1
23 atoms
O  1.6088 -0.921131 1.638625
O  3.011433 -1.614576 -0.082273
O  -2.645864 -1.918318 -0.919157
O  -3.95779 -0.04364 0.779064
N  3.78297 1.106146 -0.285483
C  1.345373 0.974419 -1.044787
C  2.426805 0.771614 0.116979
C  -0.07093 0.654173 -0.633097
C  -0.701407 -0.511871 -1.019117
C  -0.767545 1.61281 0.246489
C  2.411356 -0.700926 0.524409
C  -2.062182 -0.847157 -0.573942
C  -2.041334 1.405109 0.709972
C  -2.787165 0.178585 0.355456
H  1.665648 0.349973 -1.897579
H  1.432375 2.036888 -1.344024
H  2.125777 1.379836 0.986483
H  -0.208917 -1.238055 -1.676769
H  -0.230344 2.529487 0.52408
H  3.981634 2.083069 -0.498283
H  4.254768 0.414062 -0.871395
H  -2.553368 2.126661 1.355887
H  1.570808 -1.89526 1.846062
