program: Gaussian 09
title: 000036157
version: EM64L-G09RevD.01
frameworkgroup: C1[X(C16H20ClN3O3S)]
method: RPBEPBE
basis: SDD
operation: Freq
keyword: #p
keyword: freq=noraman
keyword: PBEPBE/SDD
title: #p freq=noraman PBEPBE/SDD
converged: YES YES NO NO
title: Mulliken charges:
elementType: Cl S O O O N N N C C C C C C C C C C C C C C C C H H H H H H H H H H H H H H H H H H H H
charge: -0.061078 0.234057 -0.456134 -0.260247 -0.185752 -0.101866 -0.124966 -0.209382 -0.340601 -0.362613 -0.401282 -0.387763 -0.339682 -0.057903 0.258332 -0.552790 -0.699799 0.728149 -0.091175 -0.456374 -0.282920 -0.233906 -0.094337 -0.255528 0.213352 0.198923 0.204452 0.222416 0.229358 0.231329 0.261669 0.223253 0.209654 0.222130 0.185749 0.285232 0.254892 0.205190 0.223294 0.242048 0.341477 0.270218 0.250696 0.260230
chargesum: 0.00000
title: Mulliken charges with hydrogens summed into heavy atoms:
elementType: Cl S O O O N N N C C C C C C C C C C C C C C C C
charge: -0.061078 0.234057 -0.114657 -0.260247 -0.185752 -0.101866 -0.124966 -0.209382 0.071673 0.064255 0.059406 0.097159 0.092102 0.127845 0.258332 -0.012666 -0.029266 0.728149 -0.091175 -0.456374 -0.012702 0.016790 -0.094337 0.004702
polarizability: 3.00779858e+02 -1.22779932e+01 2.50606606e+02 -2.16001315e+01 -3.16544472e+00 1.44532524e+02
1716.lowfreq: -6.6580 -4.3963 0.0019 0.0022 0.0023 4.1536 9.8823 21.1851 33.4621
frequency: 9.0329 21.1111 33.3773 35.7806 42.2554 63.2198 71.2920 83.4595 92.2739 125.4494 152.2978 169.1088 187.0834 204.3795 220.1186 240.5824 276.8233 284.0359 292.2272 306.6085 314.5939 315.9717 334.6641 350.0444 362.8100 370.8863 402.6014 419.2492 432.1344 435.9992 442.8456 461.1230 466.4272 478.3328 542.7659 545.9771 567.7841 569.8863 597.8402 611.9008 648.5267 683.9920 711.0062 725.5067 767.3053 783.3244 800.7056 827.1130 837.0542 848.8846 862.7931 892.0380 909.9256 927.6380 935.9990 958.1121 966.0524 1000.3732 1026.3065 1041.4862 1048.1494 1060.0554 1062.4155 1074.3608 1076.7645 1081.8216 1103.7820 1138.4442 1144.5291 1153.5282 1173.0436 1194.0014 1197.7528 1218.6249 1240.8603 1254.9736 1259.6381 1282.8432 1292.3632 1300.9793 1313.5990 1318.2729 1332.7932 1337.2270 1339.2406 1352.1015 1359.1376 1372.2116 1381.8249 1389.2533 1397.9024 1416.4896 1430.2977 1451.6976 1456.3094 1458.3848 1462.7899 1463.7014 1467.1737 1471.8973 1474.6536 1478.0778 1580.3289 1600.6083 1606.2920 1666.2031 2859.7922 2877.2768 2915.2629 2938.8349 2974.9098 2982.9308 2991.7299 2998.1631 3041.0368 3044.9789 3048.0456 3064.9309 3069.7571 3088.5759 3095.6993 3097.5796 3159.3410 3179.3651 3183.8797 3567.6314
redmass: 7.4906 4.4766 4.7558 5.9269 4.2539 4.2726 5.4786 9.1557 5.9510 9.8850 3.7781 5.7634 6.6975 3.1282 3.0437 1.1446 2.8783 1.1793 7.1725 7.4685 3.2258 2.6244 2.6635 4.2776 4.5850 5.8325 2.3978 3.0236 3.1861 2.3075 5.3702 8.6151 2.7667 4.7548 3.2537 7.6543 5.9252 5.3549 3.7253 4.6699 3.2773 7.0899 4.0445 7.8683 4.3146 4.3840 1.3233 2.6316 1.6023 1.5482 4.9034 1.7743 2.7075 2.1475 1.3425 2.1324 2.9077 2.4062 4.6601 2.6410 1.8047 1.6633 3.8171 1.7790 2.2463 2.0694 2.4358 1.5470 2.4615 2.9355 2.2851 2.1164 1.0723 1.5170 1.7685 1.2509 1.3718 1.3132 1.4047 1.5362 1.2878 2.5875 1.3274 1.4699 1.4976 1.3806 1.3324 1.3117 1.4453 9.4848 1.5507 2.1739 2.8286 1.2632 1.0932 1.1584 1.6323 1.1958 1.1296 1.3136 1.0860 1.0813 8.3569 7.8720 8.3359 11.5550 1.0709 1.0698 1.0687 1.0830 1.0362 1.0677 1.0660 1.0604 1.0902 1.0914 1.0908 1.1010 1.0988 1.0992 1.0940 1.0970 1.0896 1.0931 1.0966 1.0662
irintensity: 0.0746 0.5494 0.8380 1.4988 0.2149 2.3664 1.4863 0.9763 1.8647 0.2462 0.7669 0.3560 1.9732 4.4750 7.0021 0.5012 16.5679 123.8743 5.4964 0.4597 10.7297 10.4869 10.1710 4.7255 10.4055 10.6372 2.4408 2.4715 13.9935 1.8773 5.5522 8.6982 0.7169 6.9659 1.7167 16.7614 7.9884 17.8789 29.2632 6.7757 9.6332 2.2503 0.0701 14.6901 10.6618 16.9374 38.7229 3.6471 0.4898 30.6407 31.5348 5.1147 41.4257 6.7541 0.0213 10.3749 8.8676 105.3752 16.8227 35.3488 11.3008 116.7044 22.4547 18.1373 4.7987 7.0508 34.2553 16.5294 46.8026 13.7754 89.4939 10.7659 3.7802 130.4872 61.8330 4.7087 12.0071 18.5597 29.8861 33.2815 18.4373 39.2272 6.7903 4.8895 3.4450 0.5410 4.9005 15.2004 31.0759 8.9155 1.9495 85.6928 16.3530 51.4044 6.2149 26.5688 25.8763 21.6248 31.2330 91.6856 12.0965 12.9516 50.9566 37.9963 382.7973 459.0609 56.3768 69.7843 80.4110 64.3645 26.2959 27.7967 42.0385 32.6885 8.8532 34.0554 58.6749 5.3701 40.8151 26.9250 25.1172 4.0047 2.1854 2.8371 1.1399 3.7723
temp: 298.150 k
press: 1.00000 atm
elementType: 17 16 8 8 8 7 7 7 6 6 6 6 6 6 6 6 6 6 6 6 6 6 6 6 1 1 1 1 1 1 1 1 1 1 1 1 1 1 1 1 1 1 1 1
symmnumber: 1
zpe: 903214.2 jmol-1
zpe.correction: 0.344016 hartree
zpe.thermalcorrener: 0.367609 hartree
zpe.thermalcorrenthalpy: 0.368554 hartree
zpe.thermalcorrgfe: 0.287376 hartree
zpe.sumelectzpe: -1867.959056 hartree
zpe.sumelectthermal: -1867.935462 hartree
zpe.sumelectthermalent: -1867.934518 hartree
zpe.sumelectthermalfe: -1868.015696 hartree
dipole: 3.5236 3.2420 -3.2364
dipole: 5.7794
quadrupole: -135.2171 -176.3395 -155.1985
quadrupole: 11.5400 -7.9318 0.1453
quadrupole: 20.3679 -20.7545 0.3865 11.5400 -7.9318 0.1453
hfenergy: -1868.3030716 hartree
pointgroup: C01 [X(C16H20Cl1N3O3S1)]
dipole: 1.3826295 -1.3356807 1.214221 debye
polarizability: 299.736806|11.443262|250.8569163|24.8316177|3.9128572|145.3252656 unknown
InChI: InChI=1S/C16H20ClN3O3S/c1-11(21)9-18-4-6-19(7-5-18)15(22)10-20-13-8-12(17)2-3-14(13)24-16(20)23/h2-3,8,11,21H,4-7,9-10H2,1H3
charge 0 multiplicity 1
44 atoms
Cl -4.338647 -3.806598 0.047924
S  -4.240467 2.598082 -0.05829
O  7.65801 0.605986 0.572684
O  -0.619761 0.051664 -1.545453
O  -1.622589 3.303212 0.595703
N  4.09922 -0.178568 -0.21442
N  1.229617 -0.404796 -0.201534
N  -2.17305 1.001044 0.524831
C  3.303046 0.407557 0.889865
C  3.332966 -0.130827 -1.486883
C  1.982187 -0.373112 1.070347
C  2.017685 -0.919494 -1.345698
C  5.461074 0.401258 -0.320798
C  6.448972 -0.238781 0.675662
C  -0.061626 0.05274 -0.408099
C  -0.815719 0.566084 0.851845
C  6.743544 -1.711689 0.356606
C  -3.239379 0.123062 0.248621
C  -2.436097 2.376186 0.404829
C  -4.452081 0.795298 -0.067724
C  -3.189196 -1.286387 0.285118
C  -5.624502 0.075518 -0.3505
C  -4.378659 -1.983529 0.006604
C  -5.592008 -1.338856 -0.309247
H  3.881203 0.352314 1.829776
H  3.066121 1.485611 0.699154
H  3.096871 0.918558 -1.79324
H  3.943066 -0.590094 -2.285287
H  2.221976 -1.411919 1.373776
H  1.384685 0.092617 1.869041
H  1.39626 -0.826005 -2.250557
H  2.249386 -1.98818 -1.168517
H  5.845318 0.222213 -1.34193
H  5.469064 1.504203 -0.157335
H  6.036004 -0.16264 1.706172
H  -0.295327 1.445813 1.270826
H  -0.857919 -0.216217 1.63274
H  7.387038 -2.175794 1.128589
H  7.253228 -1.797214 -0.620693
H  5.794706 -2.275381 0.310451
H  8.391439 0.181795 1.085529
H  -2.262524 -1.826403 0.491451
H  -6.55576 0.5927 -0.598995
H  -6.490477 -1.923029 -0.523242
