program: Gaussian 09
title: 000036194
version: EM64L-G09RevD.01
frameworkgroup: C1[X(C24H27NO2)]
method: RPBEPBE
basis: SDD
operation: Freq
keyword: #p
keyword: freq=noraman
keyword: PBEPBE/SDD
title: #p freq=noraman PBEPBE/SDD
converged: YES YES NO NO
title: Mulliken charges:
elementType: O O N C C C C C C C C C C C C C C C C C C C C C C C C H H H H H H H H H H H H H H H H H H H H H H H H H H H
charge: -0.437530 -0.324274 -0.509130 0.458001 -0.107571 -0.097818 -0.109904 -0.524543 -0.529653 -0.519891 -0.450761 -0.450295 -0.450226 -0.698240 0.510105 -0.382076 -0.405513 -0.461008 -0.415476 0.432853 0.314093 0.051552 -0.367976 -0.300472 -0.219662 0.144226 -0.259884 0.194857 0.194662 0.193540 0.186135 0.222873 0.198494 0.198871 0.221601 0.185860 0.196547 0.190735 0.194841 0.193678 0.196150 0.190648 0.210886 0.210368 0.234018 0.231388 0.242171 0.266281 0.367122 0.271048 0.273438 0.227622 0.232830 0.384407
chargesum: 0.00000
title: Mulliken charges with hydrogens summed into heavy atoms:
elementType: O O N C C C C C C C C C C C C C C C C C C C C C C C C
charge: -0.053123 -0.324274 -0.142008 0.458001 0.087286 0.096844 0.083636 -0.115536 -0.132287 -0.112430 -0.063480 -0.061776 -0.063427 -0.276985 0.510105 -0.148058 -0.174124 -0.218838 -0.149195 0.432853 0.314093 0.051552 -0.096927 -0.027033 0.007961 0.144226 -0.027055
polarizability: 4.19984341e+02 -2.43349401e+01 2.64509577e+02 -2.12510132e+01 -1.74644992e+01 1.80378848e+02
1716.lowfreq: -48.4057 -0.0009 -0.0004 -0.0003 4.3674 6.5064 11.4051 22.4487 25.6069
frequency: -42.1242 22.2276 23.0743 52.6802 68.8130 77.8675 99.4759 143.4680 147.8289 173.7898 190.9793 218.2958 235.0869 283.4503 297.0157 298.0825 325.7048 339.8142 355.6371 377.2635 390.6593 393.7405 408.4686 412.3305 417.6207 424.7355 425.8934 433.0592 492.3878 506.8220 520.7190 558.9475 569.4100 586.2141 601.3034 630.2266 636.1733 637.3133 646.6483 681.2535 694.8589 724.5058 740.1223 748.3796 767.4955 770.1265 784.5986 797.8663 800.8582 809.7304 817.8429 837.6129 853.1061 869.0410 870.3376 871.2638 875.7839 878.2890 885.6823 912.8389 944.1769 952.9222 953.4423 964.3482 971.4353 975.3013 979.0613 981.7476 991.7348 1007.9164 1009.2057 1042.5309 1045.6203 1046.5400 1046.9040 1092.0349 1098.5296 1101.7488 1103.3504 1111.1834 1112.5189 1117.5379 1118.0556 1151.8720 1165.1057 1177.5086 1177.6454 1190.9420 1197.7055 1219.1993 1227.6718 1241.2665 1259.1703 1277.3198 1283.8495 1288.3987 1296.5474 1300.2353 1309.6218 1310.3148 1316.1077 1317.0595 1322.9076 1324.0654 1342.5622 1342.8154 1344.2516 1353.6856 1359.1251 1359.5328 1373.8010 1394.9575 1416.1201 1443.8568 1449.3504 1450.8848 1459.2837 1459.5588 1461.3473 1462.4314 1467.7463 1481.9501 1504.1640 1521.1684 1571.5035 1580.9247 1611.4449 1625.8242 1640.2632 2945.7265 2948.6410 2954.1732 2958.8412 2960.4420 2961.0154 2961.8544 2988.5564 2989.0448 3001.6175 3003.2727 3013.0412 3015.6416 3016.1282 3021.7390 3024.3540 3025.8840 3119.4537 3122.7101 3132.4518 3143.4474 3156.4137 3158.9967 3174.9587 3181.7674 3271.2098 3533.2986
redmass: 3.5642 5.4320 5.8755 5.7673 3.9867 4.7380 7.8669 4.5652 4.4494 5.9013 3.8492 4.3092 3.8799 5.2256 2.0427 2.8615 2.7112 3.1256 3.2847 2.6797 4.5143 4.5418 4.0928 3.2715 1.8075 2.6561 1.8075 2.0634 4.5467 3.7217 3.0734 5.0418 1.1948 4.1581 4.1677 4.6768 4.0760 3.9190 5.4501 4.3744 4.0294 3.7524 3.3831 3.1889 3.2688 1.5334 3.7284 2.6952 1.7586 2.6261 2.3580 1.3364 2.0108 1.7114 1.5774 1.5741 1.5060 1.7365 4.4003 3.4783 1.9216 1.4664 1.9282 1.3639 2.1720 1.3682 2.0120 2.4173 1.3164 5.3409 2.8215 2.1812 1.7971 1.7755 1.7520 1.9783 1.3715 1.1233 1.2542 1.7638 1.0125 1.9943 1.6420 1.1258 1.6346 1.1085 1.2332 1.1331 1.0624 2.3588 2.2039 1.4281 1.7791 1.7681 1.8563 1.9018 1.8539 2.1782 1.8689 1.5963 1.5384 1.4396 1.8833 1.3139 1.4516 1.5535 2.2097 1.4558 1.7905 1.6184 3.1841 7.5933 3.3317 2.8181 1.0837 1.0835 2.3551 1.0955 1.1030 1.0921 1.0999 1.0913 2.6228 3.5164 6.5096 6.8132 3.5236 4.9511 3.2447 1.0600 1.0615 1.0628 1.0635 1.0610 1.0594 1.0607 1.0838 1.0837 1.0837 1.1023 1.1007 1.1019 1.1019 1.1013 1.1004 1.1017 1.0876 1.0886 1.0873 1.0965 1.0910 1.0943 1.0936 1.0987 1.0795 1.0641
irintensity: 0.0187 0.1565 0.0816 0.9275 0.8407 0.0700 0.1011 0.5135 0.1211 0.3470 1.0384 2.0670 6.1338 3.1901 0.1100 0.8537 1.8463 2.9174 0.2038 1.7713 0.1520 0.1169 6.6425 2.4180 0.6480 9.1389 0.8715 1.0286 18.3327 8.0030 16.5908 0.6714 113.3331 21.2835 30.4628 13.3388 0.0260 1.2371 6.4212 36.1574 6.0119 4.8983 9.3762 13.1384 5.5693 82.3572 0.6339 2.9172 52.4483 14.2517 28.0654 3.3723 50.6178 0.4185 0.0997 0.1088 3.5790 1.1878 5.9307 0.2177 3.3977 0.5759 2.2818 0.5693 8.7895 3.8093 0.7239 4.7706 1.4538 315.6189 9.2074 23.8560 0.8939 0.6842 0.1938 8.2616 0.6072 1.4713 3.3464 183.9658 0.0156 13.0599 25.3590 4.3029 167.9555 1.3314 0.6051 3.0139 0.3352 1.9224 16.2665 0.3235 4.7704 0.3090 0.7671 0.0634 0.3044 31.2481 4.3500 2.3047 19.8008 13.7441 48.1237 0.3520 3.0705 35.7806 201.7758 7.4606 1.0017 0.1225 6.5290 0.9688 10.2356 85.4309 0.2784 2.4386 173.2666 3.0510 9.0549 19.7454 19.4256 0.0910 33.8189 416.5923 31.1903 187.6493 316.9282 4.9400 175.6124 19.6461 25.4898 44.4518 30.6226 22.0709 51.8203 47.5211 154.5182 150.9069 72.8335 15.6679 5.1606 3.1242 2.3061 66.8321 83.1980 116.7465 11.7419 33.3228 9.3735 15.0201 14.9956 2.6114 6.0005 12.6499 193.8831 72.0534
temp: 298.150 k
press: 1.00000 atm
elementType: 8 8 7 6 6 6 6 6 6 6 6 6 6 6 6 6 6 6 6 6 6 6 6 6 6 6 6 1 1 1 1 1 1 1 1 1 1 1 1 1 1 1 1 1 1 1 1 1 1 1 1 1 1 1
symmnumber: 1
zpe: 1195071.9 jmol-1
zpe.correction: 0.455179 hartree
zpe.thermalcorrener: 0.476323 hartree
zpe.thermalcorrenthalpy: 0.477267 hartree
zpe.thermalcorrgfe: 0.405097 hartree
zpe.sumelectzpe: -1134.042574 hartree
zpe.sumelectthermal: -1134.021431 hartree
zpe.sumelectthermalent: -1134.020486 hartree
zpe.sumelectthermalfe: -1134.092656 hartree
dipole: 1.0682 0.9355 -0.0477
dipole: 1.4207
quadrupole: -149.5175 -154.0982 -161.5494
quadrupole: -2.2777 -2.4505 -4.5492
quadrupole: 5.5376 0.9568 -6.4944 -2.2777 -2.4505 -4.5492
hfenergy: -1134.4977531 hartree
pointgroup: C01 [X(C24H27N1O2)]
dipole: -0.4140227 0.3672834 0.0782731 debye
polarizability: 420.5837956|24.9387706|256.3132452|-18.2409637|29.6215015|187.9757246 unknown
InChI: InChI=1S/C24H27NO2/c26-23(27)21-3-1-2-4-22(21)25-20-7-5-16(6-8-20)12-24-13-17-9-18(14-24)11-19(10-17)15-24/h1-8,17-19,25-26H,9-15H2
charge 0 multiplicity 1
54 atoms
O  7.198117 -1.079661 -0.761547
O  5.141425 -2.116219 -0.952215
N  2.977024 -0.739405 -0.20057
C  -3.652101 -0.542502 0.371018
C  -4.651282 0.36935 -1.798561
C  -6.135126 0.076249 0.235796
C  -4.379719 1.904144 0.201638
C  -3.615442 -0.611198 -1.183801
C  -5.094329 -0.901922 0.843521
C  -3.345207 0.919625 0.81123
C  -6.07698 -0.009355 -1.313526
C  -4.319678 1.818231 -1.347545
C  -5.805367 1.525757 0.685364
C  -2.651419 -1.559157 1.017805
C  -1.1782 -1.338531 0.710847
C  -0.554926 -1.940544 -0.414157
C  -0.365425 -0.527763 1.546021
C  0.803009 -1.714346 -0.713763
C  0.998067 -0.30184 1.268911
C  1.598105 -0.879465 0.117277
C  3.812527 0.353613 -0.002371
C  5.239945 0.214479 -0.218129
C  3.318956 1.645631 0.367081
C  6.100217 1.332865 -0.017301
C  4.191995 2.727666 0.546416
C  5.800755 -1.064964 -0.660735
C  5.595468 2.580594 0.371516
H  -4.604804 0.304603 -2.904045
H  -7.148906 -0.201835 0.586992
H  -4.138338 2.936094 0.526294
H  -3.835662 -1.64842 -1.514358
H  -2.599274 -0.362166 -1.547851
H  -5.142149 -0.863885 1.951898
H  -5.335331 -1.943328 0.543714
H  -2.323772 1.202619 0.490215
H  -3.369057 0.985556 1.919539
H  -6.825417 0.675474 -1.760686
H  -6.33092 -1.036141 -1.646813
H  -3.310151 2.105348 -1.704883
H  -5.04184 2.529915 -1.796181
H  -6.550167 2.232028 0.266064
H  -5.865413 1.604396 1.789985
H  -2.950412 -2.575365 0.688363
H  -2.80597 -1.522715 2.115778
H  -1.144061 -2.595683 -1.067044
H  -0.804316 -0.080577 2.446468
H  1.257588 -2.180056 -1.596042
H  1.603259 0.281157 1.969513
H  3.457456 -1.56037 -0.613093
H  2.242458 1.797151 0.473129
H  7.171377 1.189513 -0.183509
H  3.776317 3.705694 0.815495
H  6.267193 3.430885 0.522201
H  7.475106 -1.982123 -1.07406
