program: Gaussian 09
title: 000036125
version: EM64L-G09RevD.01
frameworkgroup: C1[X(C17H20ClNO)]
method: RPBEPBE
basis: SDD
operation: Freq
keyword: #p
keyword: freq=noraman
keyword: PBEPBE/SDD
title: #p freq=noraman PBEPBE/SDD
converged: YES YES NO NO
title: Mulliken charges:
elementType: Cl O N C C C C C C C C C C C C C C C C C H H H H H H H H H H H H H H H H H H H H
charge: -0.077392 -0.273260 -0.133779 -0.412955 -0.521083 -0.323038 -0.296954 0.463986 -0.579603 -0.450328 -0.368627 -0.216907 -0.223480 0.368624 -0.242864 -0.348944 -0.378433 -0.222687 -0.196571 -0.256839 0.249767 0.223131 0.229307 0.214580 0.233087 0.233028 0.206928 0.229180 0.266213 0.266739 0.233468 0.248610 0.227198 0.226738 0.229830 0.246609 0.249069 0.223025 0.226993 0.227632
chargesum: 0.00000
title: Mulliken charges with hydrogens summed into heavy atoms:
elementType: Cl O N C C C C C C C C C C C C C C C C C
charge: -0.077392 -0.273260 -0.133779 0.059942 -0.077196 0.143078 0.139155 0.463986 -0.046651 -0.216860 -0.120017 0.010291 0.003257 0.368624 -0.013034 -0.102335 -0.129364 0.000339 0.030422 -0.029206
polarizability: 2.14273461e+02 2.22550534e+00 2.08393905e+02 1.80270100e+01 7.54781052e+00 1.76559066e+02
1716.lowfreq: -3.7966 -0.0027 -0.0024 -0.0023 5.8339 6.7422 17.4663 26.4546 28.1463
frequency: 17.4008 26.3240 27.8798 31.6496 33.1334 57.3547 80.9022 92.9694 121.1022 152.5191 168.7245 192.0770 202.5364 232.0626 258.6051 267.7386 338.0063 351.0121 402.9107 408.0503 412.3745 443.3669 467.3732 503.1446 519.7832 574.5708 605.1863 610.6233 617.2079 662.1851 692.1879 706.0850 744.6222 758.5796 772.9510 782.5661 808.8457 813.8801 829.7306 859.9226 861.7345 890.7273 915.5979 961.4012 975.1640 979.1001 982.0434 983.9890 987.6244 990.5161 999.5152 1001.6045 1023.2065 1025.9325 1043.6625 1066.7748 1080.7879 1082.9712 1093.6471 1107.8784 1145.5786 1167.1593 1171.2874 1179.0662 1181.8215 1191.4005 1211.1989 1218.9955 1235.1615 1254.5069 1259.7316 1283.3872 1295.8431 1314.5090 1321.7344 1336.8144 1359.6291 1363.2673 1382.4537 1389.5951 1398.5376 1441.4096 1443.7521 1453.0040 1466.6909 1469.1578 1475.8385 1479.9749 1484.9413 1488.4522 1592.4390 1595.2974 1612.0619 1614.7960 2876.4165 2923.0323 2942.6983 2952.8869 2997.2101 3021.2546 3051.0130 3059.6545 3066.6631 3113.6902 3124.3401 3127.8324 3136.6031 3137.1465 3146.4424 3147.6804 3155.0359 3163.4107 3163.5862 3172.5813
redmass: 6.7157 5.7615 4.5451 4.8718 3.8351 5.9343 3.9449 2.5466 4.0620 2.1362 4.2560 4.1386 5.4043 5.0379 3.1702 3.4216 2.7251 4.0727 3.0237 2.9472 2.9277 4.1692 3.4521 2.8565 3.5123 6.9406 4.9521 6.4060 6.3239 6.0450 2.0330 2.1369 1.5862 1.6552 1.1501 5.1341 2.4290 1.4663 1.2628 1.5641 2.3363 1.4558 1.3652 1.3602 4.1187 2.2673 1.3006 1.4141 6.5496 6.1205 1.4888 1.3852 2.0469 2.1460 2.3186 2.8184 1.7312 1.5189 2.2801 1.6460 1.7451 1.0806 1.0601 1.1676 1.1108 1.2690 2.4533 3.4241 1.4026 1.3629 1.4398 1.1965 1.2137 1.3321 1.3297 1.3442 1.3766 1.6378 3.1704 4.5203 1.8647 2.1230 2.3577 1.0973 1.1680 1.1614 1.3160 1.3860 1.8709 1.2170 6.4540 6.1610 6.2649 6.1166 1.0704 1.0693 1.0685 1.0576 1.0875 1.1027 1.0928 1.0584 1.0944 1.0876 1.0859 1.0847 1.0890 1.0910 1.1120 1.0957 1.0924 1.0953 1.1014 1.1006
irintensity: 0.0874 0.3430 0.2449 0.5554 0.0468 0.7324 0.5611 1.9589 2.3334 2.6563 4.0879 0.2965 3.7391 0.9428 4.3059 1.3647 0.1279 8.6042 2.1720 2.4605 0.0141 2.1330 12.7508 11.7881 4.8028 8.1044 0.6934 0.8060 0.2219 106.7101 33.9059 35.9546 73.2125 88.9616 3.5399 16.3902 10.6179 0.4287 2.5122 3.4138 3.9552 7.2439 4.0864 0.1914 18.5204 47.9050 0.5297 3.2279 40.0427 0.3925 12.1074 2.3248 24.0830 14.7894 22.8020 30.9386 10.0452 10.5056 1.8526 24.1470 10.7314 9.5756 0.4873 43.5895 1.9159 7.1742 4.5615 241.3149 35.9121 2.4287 16.7588 12.2946 10.2306 0.5670 9.2514 2.9604 3.3651 9.3107 4.0665 5.6000 8.7250 14.0000 2.3780 5.7967 46.6091 30.7887 48.1552 42.6919 12.6263 6.3715 25.0449 0.7544 85.4813 4.9976 75.5432 47.8762 56.5860 46.7847 19.8025 28.5744 16.2718 19.8672 31.0235 8.7188 0.1908 2.9600 11.4301 12.6635 21.9798 37.3026 33.7036 22.9177 23.8339 5.8450
temp: 298.150 k
press: 1.00000 atm
elementType: 17 8 7 6 6 6 6 6 6 6 6 6 6 6 6 6 6 6 6 6 1 1 1 1 1 1 1 1 1 1 1 1 1 1 1 1 1 1 1 1
symmnumber: 1
zpe: 864066.8 jmol-1
zpe.correction: 0.329106 hartree
zpe.thermalcorrener: 0.348537 hartree
zpe.thermalcorrenthalpy: 0.349481 hartree
zpe.thermalcorrgfe: 0.276528 hartree
zpe.sumelectzpe: -1248.338103 hartree
zpe.sumelectthermal: -1248.318672 hartree
zpe.sumelectthermalent: -1248.317727 hartree
zpe.sumelectthermalfe: -1248.390680 hartree
dipole: -0.8170 -1.9851 0.0531
dipole: 2.1473
quadrupole: -122.9715 -139.2749 -118.7208
quadrupole: 6.8626 6.5806 -0.3028
quadrupole: 4.0176 -12.2859 8.2682 6.8626 6.5806 -0.3028
hfenergy: -1248.6672086 hartree
pointgroup: C01 [X(C17H20Cl1N1O1)]
dipole: -0.3737902 -0.7576158 -0.0035533 debye
polarizability: 212.4755025|1.3493021|208.0434032|20.4136124|6.5833569|178.7075252 unknown
InChI: InChI=1S/C17H20ClNO/c18-11-12-19(15-16-7-3-1-4-8-16)13-14-20-17-9-5-2-6-10-17/h1-10H,11-15H2
charge 0 multiplicity 1
40 atoms
Cl -1.776382 5.238711 0.425505
O  1.999184 -0.113451 -0.874129
N  -1.466486 1.242038 -0.648259
C  -0.303277 0.500915 -1.186317
C  -2.785755 0.669395 -1.007105
C  -1.394111 2.715343 -0.771746
C  0.869726 0.540826 -0.197324
C  -3.059005 -0.686508 -0.360223
C  -1.766329 3.346897 0.57707
C  -3.720002 -1.705804 -1.08848
C  -2.700223 -0.932097 0.989296
C  -4.028064 -2.944327 -0.479369
C  -3.003751 -2.168566 1.5998
C  3.210729 -0.226349 -0.169981
C  -3.671381 -3.179338 0.867942
C  3.418046 0.258299 1.145562
C  4.260317 -0.874228 -0.868349
C  4.685066 0.088603 1.752336
C  5.515302 -1.035235 -0.249533
C  5.737123 -0.55475 1.065229
H  -0.594123 -0.552653 -1.338376
H  0.037453 0.895984 -2.170406
H  -3.556767 1.389832 -0.66822
H  -2.910298 0.579139 -2.114055
H  -2.064659 3.10743 -1.567481
H  -0.367928 3.020733 -1.043543
H  1.141138 1.585663 0.062666
H  0.603821 -0.001637 0.731472
H  -2.780342 3.073644 0.905926
H  -1.030386 3.109281 1.358571
H  -3.993332 -1.531904 -2.137138
H  -2.173549 -0.147049 1.543732
H  -4.538352 -3.724264 -1.055803
H  -2.720599 -2.346226 2.643659
H  -3.905517 -4.13976 1.340597
H  2.617546 0.758889 1.698322
H  4.069812 -1.238561 -1.88266
H  4.844144 0.463976 2.7697
H  6.322951 -1.537123 -0.794088
H  6.714061 -0.681569 1.543203
