program: Gaussian 09
title: 000036089
version: EM64L-G09RevD.01
frameworkgroup: C1[X(C10H18O2)]
method: RPBEPBE
basis: SDD
operation: Freq
keyword: #pfreq=noraman
keyword: PBEPBE/SDD
title: #p freq=noraman PBEPBE/SDD
converged: YES YES NO NO
title: Mulliken charges:
elementType: O O C C C C C C C C C C H H H H H H H H H H H H H H H H H H
charge: -0.476396 -0.458222 -0.049447 0.288314 -0.516430 -0.488990 -0.190150 0.445062 -0.415676 -0.757225 -0.762015 -0.811924 0.210938 0.185252 0.261360 0.252976 0.210284 0.185977 0.204501 0.204025 0.214074 0.240618 0.255152 0.201079 0.216285 0.332861 0.258581 0.212241 0.213224 0.333672
chargesum: 0.00000
title: Mulliken charges with hydrogens summed into heavy atoms:
elementType: O O C C C C C C C C C C
charge: -0.143535 -0.124550 0.161491 0.288314 -0.069818 -0.025730 -0.004174 0.445062 -0.211175 -0.098507 -0.089499 -0.127878
polarizability: 1.37809296e+02 -4.92400635e+00 1.13323543e+02 7.56975718e-01 -2.42433245e+00 8.80164389e+01
1716.lowfreq: -2.3841 0.0002 0.0004 0.0009 7.9647 15.2591 48.4318 73.3680 118.3076
frequency: 48.3347 73.3373 118.3016 160.3693 162.7345 214.7471 229.2571 245.1080 259.5115 275.0664 278.5947 284.9166 305.8340 318.9564 341.5423 371.8330 393.3670 458.8631 472.3639 492.3061 540.1669 596.2155 635.8489 746.4370 765.5495 812.9172 855.1022 903.7875 912.6222 921.6313 935.8518 956.3182 984.6508 992.2538 1032.2280 1049.3733 1058.8410 1085.5997 1104.7666 1129.5530 1147.3197 1151.9146 1165.4609 1196.5719 1218.3767 1235.7699 1270.5901 1295.1381 1307.0074 1315.8055 1328.2990 1332.8684 1359.4269 1376.0847 1392.7697 1393.7178 1406.9844 1451.8239 1455.9519 1462.6802 1470.0090 1472.7856 1474.8828 1479.8678 1491.4480 1695.7793 2887.5981 2951.7544 2965.2091 2968.4258 2973.3036 2978.1487 2990.4372 3015.4869 3051.2187 3057.4276 3064.6375 3067.4741 3086.2575 3094.6452 3095.6416 3099.8834 3553.9276 3557.5958
redmass: 3.5066 3.1700 3.0658 1.6334 1.3672 1.2453 1.7532 1.8626 1.1468 1.0980 2.8591 2.4554 2.9162 2.1424 2.4814 2.1400 3.5950 3.6827 2.8571 2.9940 2.8383 3.3505 3.8236 2.7251 4.6606 1.2374 2.5045 2.3061 1.5302 1.6379 1.8737 1.9192 2.2202 1.6643 1.6005 1.6312 2.2147 2.0446 1.5182 2.4396 1.3035 1.6919 1.8957 2.4091 1.5488 1.4492 1.2077 1.3353 1.4956 1.3465 1.6409 1.3942 1.8882 1.2226 1.2115 1.2742 1.8722 1.0478 1.0639 1.0709 1.0724 1.0687 1.0650 1.0728 1.0612 7.0175 1.0820 1.0822 1.0590 1.0391 1.0376 1.0381 1.0624 1.0997 1.0928 1.0986 1.0985 1.0975 1.1003 1.0905 1.0981 1.0978 1.0660 1.0660
irintensity: 0.3381 0.9631 0.6502 0.3166 1.6497 2.0410 3.5847 2.1540 143.6086 122.0561 2.6199 1.7569 6.6484 6.7565 6.4566 0.7956 3.3046 2.5497 4.6812 6.6082 4.8598 3.1979 1.3961 2.7959 22.9567 11.7462 13.1068 7.7089 1.9463 15.9936 14.7225 1.9453 68.4728 25.3580 14.9603 15.1070 15.9600 16.2535 65.4597 1.9063 2.4704 3.5704 60.2703 9.5177 24.0656 9.3645 11.4196 1.5253 5.4080 1.7221 50.4878 1.0340 3.0261 32.2401 15.8984 15.8424 4.6392 12.4841 5.2413 3.3390 1.3543 6.5554 16.2662 9.2927 21.5657 0.4398 61.6203 19.8774 27.3082 46.4318 14.1439 36.9159 46.7500 29.7088 24.8662 2.1813 37.5810 64.0759 12.4191 47.6117 24.8386 26.4572 4.4649 3.8391
temp: 298.150 k
press: 1.00000 atm
elementType: 8 8 6 6 6 6 6 6 6 6 6 6 1 1 1 1 1 1 1 1 1 1 1 1 1 1 1 1 1 1
symmnumber: 1
zpe: 683866.0 jmol-1
zpe.correction: 0.260471 hartree
zpe.thermalcorrener: 0.274370 hartree
zpe.thermalcorrenthalpy: 0.275315 hartree
zpe.thermalcorrgfe: 0.221319 hartree
zpe.sumelectzpe: -541.313096 hartree
zpe.sumelectthermal: -541.299196 hartree
zpe.sumelectthermalent: -541.298252 hartree
zpe.sumelectthermalfe: -541.352248 hartree
dipole: 3.3120 0.4630 -1.9153
dipole: 3.8539
quadrupole: -72.1372 -69.2380 -76.7673
quadrupole: 1.7033 2.6507 -1.5645
quadrupole: 0.5770 3.4761 -4.0531 1.7033 2.6507 -1.5645
hfenergy: -541.5735664 hartree
pointgroup: C01 [X(C10H18O2)]
dipole: 1.3052078 0.1538469 -0.7561157 debye
polarizability: 137.6752071|-5.2350331|113.3808428|0.7931231|-2.8061783|88.0932284 unknown
InChI: InChI=1S/C10H18O2/c1-7-4-5-8(6-9(7)11)10(2,3)12/h4,8-9,11-12H,5-6H2,1-3H3
charge 0 multiplicity 1
30 atoms
O  2.310075 0.216714 1.422297
O  -2.502537 1.864323 0.298614
C  0.728491 -0.129036 -0.3776
C  2.243099 0.074646 -0.060745
C  -0.157818 1.038164 0.124071
C  0.174759 -1.455861 0.209176
C  -1.608177 0.888276 -0.373944
C  -2.176121 -0.498468 -0.10663
C  -1.339782 -1.540031 0.154295
C  2.810338 1.355196 -0.718108
C  3.086563 -1.150049 -0.490032
C  -3.68084 -0.646166 -0.183029
H  0.645375 -0.180555 -1.485654
H  0.237443 2.015392 -0.217063
H  -0.154602 1.044672 1.228859
H  0.520599 -1.548996 1.259382
H  0.595704 -2.323681 -0.33617
H  -1.640683 1.084996 -1.473188
H  -1.778131 -2.533076 0.332834
H  3.901647 1.427446 -0.546504
H  2.643457 1.35249 -1.811368
H  2.343451 2.259325 -0.29377
H  2.798395 -2.04681 0.082575
H  4.162597 -0.960976 -0.309269
H  2.961025 -1.366329 -1.567283
H  3.260499 0.319083 1.684181
H  -4.171566 0.015402 0.552386
H  -3.991964 -1.689144 0.003411
H  -4.061802 -0.341324 -1.178261
H  -2.119996 2.769475 0.17034
