program: Gaussian 09
title: 000002988
version: EM64L-G09RevD.01
frameworkgroup: C1[X(C22H24O7)]
method: RPBEPBE
basis: SDD
operation: Freq
keyword: #pfreq=noraman
keyword: PBEPBE/SDD
title: #p freq=noraman PBEPBE/SDD
converged: YES YES NO NO
title: Mulliken charges:
elementType: O O O O O O O C C C C C C C C C C C C C C C C C C C C C C H H H H H H H H H H H H H H H H H H H H H H H H
charge: -0.189322 -0.211130 -0.283297 -0.266133 -0.306587 -0.292142 -0.332725 -0.133627 -0.225395 -0.362168 -0.630237 -0.636848 0.170680 0.578915 0.625581 -0.500959 -0.418176 -0.575500 -0.604225 0.210903 -0.352011 0.166556 0.281815 0.280492 0.016905 -0.226121 -0.533965 -0.535188 -0.528543 0.261832 0.276584 0.232131 0.225933 0.233076 0.209385 0.250228 0.219160 0.249044 0.233988 0.269456 0.251610 0.253255 0.241054 0.258655 0.243402 0.245461 0.225627 0.226382 0.248613 0.241605 0.254843 0.225339 0.235788
chargesum: 0.00000
title: Mulliken charges with hydrogens summed into heavy atoms:
elementType: O O O O O O O C C C C C C C C C C C C C C C C C C C C C C
charge: -0.189322 -0.211130 -0.283297 -0.266133 -0.306587 -0.292142 -0.332725 0.128204 0.051189 0.095896 -0.187777 -0.167460 0.170680 0.578915 0.625581 -0.251915 -0.184188 -0.306044 -0.352615 0.210903 -0.098755 0.166556 0.281815 0.280492 0.016905 0.273588 0.180525 0.181412 0.187428
polarizability: 3.19793000e+02 -7.24496096e+00 2.04162230e+02 1.23120473e+01 3.84557903e+01 2.22219223e+02
1716.lowfreq: -6.3133 -5.0515 -0.0007 -0.0006 -0.0005 6.3014 28.5425 31.0471 40.0099
frequency: 27.6687 30.9449 39.9984 44.1881 50.6563 57.0927 59.9484 71.7937 84.8419 89.8876 96.7015 126.1106 128.2864 151.6947 153.5414 155.1461 173.1935 181.3355 192.5521 196.3129 212.8775 224.3190 239.4635 249.5881 267.7149 292.3957 296.8806 318.4223 323.5216 341.0863 361.0361 398.5832 413.3231 420.9493 466.6585 469.9115 472.7762 508.9822 517.8578 547.3813 585.5779 591.6615 606.8713 622.8121 645.5702 648.6102 669.1323 674.8506 701.5669 713.6140 727.1219 759.7622 762.0222 777.3544 802.1326 821.7476 832.5478 846.7261 862.6553 864.4968 882.9550 884.7712 893.3950 906.9569 910.6805 925.5271 931.1970 938.4497 948.0193 968.6596 989.2580 1007.5500 1029.0007 1034.9690 1056.4207 1067.0381 1080.0455 1081.4424 1108.9317 1111.7485 1112.5714 1115.3305 1117.3321 1128.9449 1146.8251 1150.8936 1152.9152 1157.2181 1161.0654 1171.0856 1184.0801 1184.7950 1210.7486 1219.5223 1224.2580 1249.8255 1262.2536 1270.1459 1298.0472 1305.2000 1308.9329 1319.1104 1338.4430 1346.6873 1358.1956 1370.4646 1397.5346 1399.5606 1417.9779 1436.0896 1439.3808 1440.6715 1457.3947 1458.3794 1462.2522 1465.9124 1471.1797 1473.1535 1475.0320 1476.8658 1483.4642 1484.4397 1488.8791 1494.8594 1571.1237 1605.7542 1611.2703 1628.2589 1696.0962 2978.2400 2981.6458 2983.6322 2986.0995 2991.6162 2998.6003 3013.4798 3030.4158 3041.1566 3046.8464 3056.1430 3078.7660 3081.1694 3087.0262 3094.6231 3120.2429 3121.6747 3122.5146 3124.0622 3132.1990 3144.4348 3149.9343 3160.6889 3175.6860
redmass: 5.0124 5.9782 4.8038 5.9302 5.2979 3.4185 5.6502 5.3617 3.3160 3.0772 3.4146 4.4116 6.7765 1.7781 2.9239 1.5434 3.4982 1.5701 1.5497 4.9374 1.6567 4.0485 4.1333 5.3327 3.9725 3.0242 3.5061 2.5914 4.0503 5.9396 4.9679 5.9534 3.4767 3.5567 5.0340 3.5455 4.9723 5.1572 4.7044 6.0730 4.8474 4.8557 6.5127 5.8326 4.6191 6.7230 4.1615 8.9214 5.7607 4.5335 5.0774 4.2880 4.0767 5.5138 1.8123 2.1719 5.7807 3.6681 2.3340 2.7625 1.7732 1.9359 1.6445 4.2461 3.3363 2.3847 1.3975 9.1379 2.9428 5.0188 2.8579 4.3463 3.6924 4.9797 3.2187 2.4030 2.2135 1.8331 2.7384 1.3323 1.2500 2.6903 1.2339 1.4565 1.0870 1.3068 1.1710 1.4012 1.4184 1.0871 1.6684 1.9659 1.4257 1.3347 1.4292 3.8551 1.4507 1.3592 2.0131 1.6496 1.4055 1.7967 1.3729 1.4522 7.0391 1.2492 3.8261 1.9140 1.2670 1.2170 4.0654 1.5781 1.3771 1.2018 1.0937 1.4591 1.2232 1.1276 1.2255 1.3510 1.0939 1.1837 1.2240 1.0574 7.3889 6.9649 7.7925 8.2480 12.5700 1.0293 1.0300 1.0304 1.0599 1.0596 1.0618 1.0643 1.0863 1.0875 1.0994 1.0988 1.1052 1.1040 1.1041 1.1063 1.1034 1.1054 1.1066 1.1039 1.0896 1.0915 1.0922 1.0930 1.0956
irintensity: 0.5584 1.1502 0.6436 1.1236 1.6092 3.1502 0.6925 0.4439 5.8908 6.6928 6.5359 3.1278 0.2188 15.0056 4.3458 7.0296 4.4945 3.3273 1.8621 0.4860 3.3265 2.1098 10.6412 2.1470 4.6315 0.7111 8.5487 2.5206 2.0998 1.9381 3.7755 1.0799 5.6504 5.7672 3.9820 0.8835 0.6873 5.7796 1.1971 6.1587 1.7621 3.5804 6.9861 7.6623 8.4229 5.9268 12.9026 0.3042 0.8712 3.6059 1.1419 14.8227 7.3815 10.8448 24.0980 19.0040 36.4301 17.4891 15.3958 20.6838 2.4066 32.7404 15.6502 15.8886 11.8650 19.1746 4.6135 68.7525 28.4167 91.5946 44.9321 70.7435 19.2836 110.2903 24.5022 1.4303 94.9455 28.9343 82.0997 8.3277 5.4253 19.4356 3.5316 18.9198 0.6288 0.4932 3.0259 6.4365 19.1705 2.6708 47.2401 24.8815 21.0547 4.8291 27.1012 107.8500 4.7696 0.7135 40.9356 32.0892 11.0939 42.5022 2.3135 1.4379 3.4200 1.3403 10.4607 44.6059 2.9872 16.4292 39.7950 17.4746 29.9819 36.6909 5.8746 12.0928 40.3334 13.2011 15.8054 49.6905 5.0936 19.3334 43.2162 23.9239 75.6476 40.8902 5.0640 0.6733 306.2524 69.4766 44.5427 54.8030 32.8041 18.6536 63.4943 42.3317 9.2549 2.2067 18.2979 23.3122 22.9373 18.8080 20.1318 23.3605 21.4673 32.3778 22.0039 25.6210 10.5698 2.1148 2.9233 4.1553 3.7098
temp: 298.150 k
press: 1.00000 atm
elementType: 8 8 8 8 8 8 8 6 6 6 6 6 6 6 6 6 6 6 6 6 6 6 6 6 6 6 6 6 6 1 1 1 1 1 1 1 1 1 1 1 1 1 1 1 1 1 1 1 1 1 1 1 1
symmnumber: 1
zpe: 1098356.0 jmol-1
zpe.correction: 0.418342 hartree
zpe.thermalcorrener: 0.446397 hartree
zpe.thermalcorrenthalpy: 0.447341 hartree
zpe.thermalcorrgfe: 0.358725 hartree
zpe.sumelectzpe: -1377.082741 hartree
zpe.sumelectthermal: -1377.054686 hartree
zpe.sumelectthermalent: -1377.053741 hartree
zpe.sumelectthermalfe: -1377.142357 hartree
dipole: -4.5135 3.5173 3.0014
dipole: 6.4615
quadrupole: -174.4859 -178.3597 -167.3763
quadrupole: 17.8579 16.2651 -0.4304
quadrupole: -1.0786 -4.9524 6.0310 17.8579 16.2651 -0.4304
hfenergy: -1377.5010824 hartree
pointgroup: C01 [X(C22H24O7)]
dipole: -1.6688104 1.368072 1.3438877 debye
polarizability: 315.7725607|-22.9697694|196.258888|16.3705336|32.0389803|234.1430039 unknown
InChI: InChI=1S/C22H24O7/c1-24-19-9-14(10-20(25-2)21(19)26-3)7-16-15(11-27-22(16)23)6-13-4-5-17-18(8-13)29-12-28-17/h4-5,8-10,15-16H,6-7,11-12H2,1-3H3
charge 0 multiplicity 1
53 atoms
O  5.250331 -1.07943 0.145417
O  4.490923 -2.383804 -1.61913
O  -1.532083 2.000904 -1.906029
O  -2.349143 3.22669 -0.018624
O  -2.221487 -0.793842 2.554061
O  -2.179454 -2.052838 -2.241001
O  -3.639822 -0.992056 0.042129
C  3.182513 0.058021 0.770194
C  2.859334 -1.09243 -0.225359
C  4.617579 -0.300235 1.248913
C  3.109346 1.478943 0.119427
C  2.002403 -2.271028 0.352602
C  4.236731 -1.609307 -0.683141
C  1.686605 2.020559 0.067287
C  0.512444 -1.962796 0.311457
C  0.822595 1.726207 -1.030412
C  1.193807 2.772973 1.165564
C  -0.183427 -2.089915 -0.914714
C  -0.186517 -1.50316 1.452177
C  -0.500211 2.16213 -0.943694
C  -0.150324 3.230653 1.232897
C  -0.981892 2.890702 0.164539
C  -1.554771 -1.165503 1.363657
C  -1.555258 -1.769396 -1.014517
C  -2.256581 -1.301115 0.133239
C  -2.772789 2.425974 -1.199081
C  -2.807961 0.566303 2.56864
C  -2.989134 -0.989265 -2.876933
C  -4.511618 -2.001856 0.695257
H  2.488124 0.044412 1.629389
H  2.335624 -0.719149 -1.122266
H  5.258242 0.578967 1.42273
H  4.616002 -0.942717 2.148075
H  3.564361 1.443316 -0.889542
H  3.730076 2.167665 0.723938
H  2.211656 -3.168127 -0.259882
H  2.330979 -2.491912 1.385917
H  1.174964 1.173695 -1.906198
H  1.871161 3.008329 1.99475
H  0.32054 -2.459388 -1.814626
H  0.306938 -1.401749 2.424544
H  -0.516002 3.821457 2.076763
H  -3.363153 3.066278 -1.870317
H  -3.3141 1.525437 -0.850501
H  -3.5529 0.685812 1.762449
H  -2.010283 1.323282 2.45844
H  -3.288814 0.663534 3.553943
H  -3.313237 -1.420604 -3.836233
H  -2.365968 -0.092793 -3.050072
H  -3.860833 -0.73315 -2.251286
H  -4.267412 -2.078414 1.76991
H  -5.541917 -1.638743 0.558834
H  -4.385287 -2.983722 0.203618
