program: Gaussian 09
title: 000036133
version: EM64L-G09RevD.01
frameworkgroup: C1[X(C17H26N2O)]
method: RPBEPBE
basis: SDD
operation: Freq
keyword: #p
keyword: freq=noraman
keyword: PBEPBE/SDD
title: #p freq=noraman PBEPBE/SDD
converged: YES YES NO NO
title: Mulliken charges:
elementType: O N N C C C C C C C C C C C C C C C C C H H H H H H H H H H H H H H H H H H H H H H H H H H
charge: -0.268758 -0.356067 -0.091407 -0.391252 -0.451937 -0.439396 0.337411 -0.548297 0.283580 0.240479 -0.394284 -0.383521 -0.406835 -0.358609 -0.251182 -0.250667 -0.326055 -0.324459 -0.703232 -0.674793 0.212559 0.211985 0.208171 0.272092 0.198878 0.225580 0.216289 0.221010 0.230895 0.291075 0.269740 0.221936 0.245486 0.196246 0.224094 0.225045 0.201814 0.181288 0.201605 0.179898 0.265150 0.213644 0.202252 0.211415 0.225112 0.206021
chargesum: 0.00000
title: Mulliken charges with hydrogens summed into heavy atoms:
elementType: O N N C C C C C C C C C C C C C C C C C
charge: -0.268758 -0.064992 -0.091407 -0.178692 -0.031780 0.031574 0.337411 -0.106427 0.283580 0.240479 -0.173274 -0.152626 0.084841 0.083123 -0.027088 -0.025621 0.057047 0.057044 -0.022186 -0.032246
polarizability: 2.39684629e+02 -1.42545945e+00 1.96496701e+02 2.38569182e+01 -2.82150789e+00 1.58284794e+02
1716.lowfreq: -0.0004 -0.0002 0.0005 4.8493 5.3592 12.5637 19.5568 26.2594 32.8025
frequency: 18.8701 26.0417 32.6080 37.8071 60.6077 71.4996 78.9195 96.0141 112.5754 153.5842 159.2815 189.5823 237.8331 248.5827 259.6145 271.4547 296.1241 302.7358 308.7228 324.7679 345.9416 385.8953 401.7972 425.7723 449.6792 457.6091 465.5470 504.8117 524.9451 536.2500 580.3539 620.6466 686.0960 705.0548 723.2295 740.5357 755.3402 757.0155 787.9962 798.9400 805.5460 822.0599 844.2166 870.8398 882.5437 890.1812 918.8434 938.2239 948.1810 982.6649 987.5872 1000.1329 1027.9812 1037.6128 1053.4138 1066.7252 1073.7993 1075.3422 1082.4198 1091.8715 1106.5782 1115.3558 1123.1878 1153.5866 1164.3771 1171.6374 1174.8563 1188.3570 1204.3402 1211.9923 1217.4922 1233.8024 1252.9627 1269.5252 1285.8480 1290.3339 1300.1873 1309.5873 1314.8076 1325.8281 1338.1839 1350.0555 1356.9726 1362.9478 1363.5273 1381.1230 1381.1803 1385.7482 1395.7037 1436.3301 1441.2689 1451.9916 1463.8678 1464.9672 1466.9840 1471.7784 1473.2722 1476.2908 1477.2930 1486.6611 1486.8985 1491.0443 1502.6667 1589.2138 1603.4900 1614.2226 2837.0369 2846.6997 2950.1557 2952.8944 2959.4716 2979.5985 2981.1227 2983.8225 3001.2337 3007.8507 3019.9190 3020.1476 3028.2950 3034.4626 3039.8195 3073.7363 3075.1372 3077.2841 3085.9036 3092.0123 3099.0813 3105.3886 3112.1694 3134.4362 3157.3134 3552.9920
redmass: 3.8026 4.1749 3.5056 3.4952 3.3947 2.7789 2.8207 4.7972 2.2180 2.8397 2.2999 3.0468 2.1268 1.5809 2.5179 2.5182 1.4605 3.1262 1.9100 2.9780 3.4819 2.6332 4.3042 2.7287 3.3710 3.1291 3.2140 3.0324 3.3195 1.2423 3.1147 3.9351 3.0860 4.5577 2.7010 1.6848 2.3100 1.6009 2.2733 1.1821 1.2269 2.6780 2.0290 1.6841 2.4064 1.8771 1.9546 2.6899 1.4275 1.3258 2.4516 2.6170 3.2835 2.5403 2.8478 1.9683 2.0212 2.3286 2.6521 1.6806 1.7169 1.8178 1.7249 1.1847 1.4301 1.6478 1.0886 2.0749 2.1516 2.4227 2.3297 1.4240 1.3791 1.2987 1.2001 1.2008 1.5016 1.3233 1.4615 1.2170 1.5106 1.3960 1.2849 1.4679 1.3482 1.2487 6.4879 1.2872 1.2228 2.2874 1.1900 1.1380 1.1028 1.0717 1.1134 1.1552 1.2586 1.0837 1.1619 2.1682 1.0961 1.0653 1.0597 6.7958 5.8347 6.2066 1.0720 1.0709 1.0655 1.0579 1.0785 1.0356 1.0669 1.0356 1.0655 1.0994 1.0927 1.0886 1.0640 1.0866 1.0995 1.1012 1.0987 1.0984 1.1008 1.1005 1.1047 1.0870 1.0884 1.0923 1.1004 1.0782
irintensity: 0.5374 0.2778 0.3966 1.1246 0.8021 2.6438 0.5105 4.2344 0.4812 0.7128 2.0565 8.2453 0.5687 1.5636 1.9695 0.2599 1.2908 4.1612 2.1031 6.0457 2.5605 7.0641 9.4339 4.4907 4.9158 4.7003 3.1847 20.9479 6.3708 80.5581 1.1576 0.7058 4.3503 1.2522 4.4322 55.0698 3.5650 15.6335 14.8915 5.7856 3.9304 7.0944 16.6436 0.2159 2.2595 4.8306 1.1758 2.9294 1.2360 0.0437 2.1753 6.5814 3.2689 6.6770 3.8184 19.2976 14.0520 5.9573 14.9463 30.8843 0.8614 6.3510 18.5179 8.7330 1.1497 9.4864 0.4352 72.9417 38.6125 36.3124 19.8405 4.3559 6.3576 11.5408 17.1863 2.9111 16.7684 25.0529 11.9918 8.0105 0.6504 1.2341 12.2989 5.7288 2.2108 5.6207 0.8548 25.9962 12.8534 12.5230 52.6038 9.0214 27.4159 18.2638 13.9510 36.5588 94.6629 11.9491 19.1229 33.7983 16.2244 11.3565 12.7935 2.6275 75.6678 26.2142 38.2334 208.8361 33.9677 40.3650 19.2317 30.5437 55.3096 35.3256 50.5850 7.5774 26.2464 37.7152 33.7150 42.4808 46.7242 18.3353 35.3835 58.7425 27.9813 44.2859 12.6254 19.6690 4.6811 29.7699 35.3274 14.6970
temp: 298.150 k
press: 1.00000 atm
elementType: 8 7 7 6 6 6 6 6 6 6 6 6 6 6 6 6 6 6 6 6 1 1 1 1 1 1 1 1 1 1 1 1 1 1 1 1 1 1 1 1 1 1 1 1 1 1
symmnumber: 1
zpe: 1050782.9 jmol-1
zpe.correction: 0.400222 hartree
zpe.thermalcorrener: 0.420949 hartree
zpe.thermalcorrenthalpy: 0.421893 hartree
zpe.thermalcorrgfe: 0.348396 hartree
zpe.sumelectzpe: -846.597785 hartree
zpe.sumelectthermal: -846.577058 hartree
zpe.sumelectthermalent: -846.576114 hartree
zpe.sumelectthermalfe: -846.649611 hartree
dipole: -0.6077 0.8122 -3.2283
dipole: 3.3839
quadrupole: -114.2337 -117.1521 -119.1516
quadrupole: -1.2678 4.8325 -1.5793
quadrupole: 2.6121 -0.3063 -2.3058 -1.2678 4.8325 -1.5793
hfenergy: -846.9980067 hartree
pointgroup: C01 [X(C17H26N2O1)]
dipole: -0.1865538 0.5508922 -1.1975582 debye
polarizability: 238.2106444|-9.3467663|197.7029728|23.6924426|1.5779691|158.5525068 unknown
InChI: InChI=1S/C17H26N2O/c1-3-19(4-2)13-12-18-17(20)16-11-7-9-14-8-5-6-10-15(14)16/h5-6,8,10,16,18H,3-4,7,9,11-13H2,1-2H3
charge 0 multiplicity 1
46 atoms
O  -0.29415 -1.042735 0.424263
N  -0.755923 0.798599 -0.90518
N  -4.43679 0.344203 -0.001506
C  1.396871 -0.373553 -1.272865
C  1.606671 -1.820575 -1.796443
C  2.069434 -2.771647 -0.672544
C  2.554393 0.098321 -0.378471
C  3.430931 -2.312343 -0.112726
C  3.486021 -0.816677 0.18622
C  0.055105 -0.25185 -0.507734
C  2.684901 1.483493 -0.099515
C  4.516905 -0.311941 1.021044
C  -2.050978 1.061424 -0.247664
C  -3.188241 0.145836 -0.776711
C  3.715057 1.973578 0.727606
C  4.639125 1.065144 1.296002
C  -4.75698 -0.789076 0.906308
C  -5.594476 0.81362 -0.805311
C  -3.707214 -1.000455 2.014448
C  -6.649111 1.566398 0.030615
H  1.345222 0.308314 -2.147145
H  0.669003 -2.190121 -2.25272
H  2.374215 -1.796015 -2.596659
H  1.307609 -2.767107 0.126279
H  2.153561 -3.804048 -1.061664
H  3.679899 -2.879841 0.804455
H  4.227808 -2.552206 -0.84912
H  1.962796 2.187185 -0.534072
H  5.232953 -1.018116 1.460977
H  -0.46096 1.385741 -1.686138
H  -1.93184 0.88107 0.833112
H  -2.322233 2.122262 -0.39141
H  -2.837588 -0.904673 -0.712222
H  -3.360811 0.360505 -1.851037
H  3.797264 3.047357 0.929718
H  5.443145 1.428245 1.946124
H  -5.733347 -0.577829 1.379313
H  -4.878912 -1.741793 0.327563
H  -5.203842 1.505437 -1.575554
H  -6.089934 -0.028931 -1.354491
H  -2.708302 -1.238014 1.606265
H  -3.61968 -0.092002 2.63728
H  -4.012701 -1.840876 2.665661
H  -7.134397 0.910794 0.77535
H  -6.174289 2.404213 0.570732
H  -7.443391 1.968586 -0.625833
