program: Gaussian 09
title: 000000884
version: EM64L-G09RevD.01
frameworkgroup: C1[X(C20H23N7O6)]
method: RPBEPBE
basis: SDD
operation: Freq
keyword: #p
keyword: freq=noraman
keyword: PBEPBE/SDD
title: #p freq=noraman PBEPBE/SDD
converged: YES YES NO NO
title: Mulliken charges:
elementType: O O O O O O N N N N N N N C C C C C C C C C C C C C C C C C C C C H H H H H H H H H H H H H H H H H H H H H H H
charge: -0.273169 -0.293021 -0.399550 -0.243333 -0.420050 -0.225466 -0.250833 -0.202599 -0.381860 -0.431919 -0.029892 -0.625297 -0.461109 -0.092923 -0.433259 -0.304316 -0.468668 0.120083 0.253834 0.416516 0.000859 -0.386926 -0.365158 0.116888 -0.362449 -0.383582 0.296418 0.147093 -0.133225 -0.391034 -0.484742 0.111450 0.180190 0.251755 0.224039 0.232249 0.256368 0.261071 0.243208 0.227930 0.294201 0.310077 0.233884 0.255907 0.204953 0.273094 0.306351 0.351450 0.310625 0.340182 0.248602 0.284103 0.271848 0.254629 0.387654 0.376869
chargesum: 0.00000
title: Mulliken charges with hydrogens summed into heavy atoms:
elementType: O O O O O O N N N N N N N C C C C C C C C C C C C C C C C C C C C
charge: -0.273169 -0.293021 -0.011895 -0.243333 -0.043181 -0.225466 -0.250833 -0.202599 -0.087659 -0.121842 -0.029892 0.032503 -0.120927 0.158833 0.023030 0.213123 0.002471 0.120083 0.253834 0.416516 0.000859 -0.153042 -0.109252 0.116888 -0.157496 -0.110488 0.296418 0.147093 0.177400 0.141672 0.041734 0.111450 0.180190
polarizability: 4.90555114e+02 1.81718050e+01 2.83251744e+02 2.86177790e+01 8.27122928e+00 1.75785186e+02
1716.lowfreq: -14.7304 -10.8684 -2.1569 -0.0013 -0.0007 0.0011 2.9371 6.7362 13.5179
frequency: -14.6801 6.3971 13.4443 17.0507 26.5360 35.5196 41.4749 49.6365 58.3077 67.4865 79.7935 85.3409 86.6561 109.6894 123.7321 126.8668 143.6249 161.2907 168.2986 179.6555 187.6997 196.5412 231.7536 243.5905 251.4006 260.5789 293.2885 308.3192 324.5225 326.0950 331.7455 360.9527 390.1606 415.2911 423.2643 435.0909 449.7389 458.7289 472.4049 492.0945 502.1720 502.9805 507.4151 513.6155 527.4282 530.6623 544.8328 557.4377 581.0251 583.8114 588.7069 596.5660 629.7393 634.0156 638.1799 640.1148 652.4308 678.1513 683.2989 686.4770 724.1590 739.9342 754.9759 765.2531 770.6881 799.2918 801.3195 826.0984 836.8003 874.6829 875.5044 898.7164 927.8744 933.0164 938.4699 974.9706 983.4266 988.1190 997.8043 1000.2700 1015.5422 1024.3694 1043.8331 1057.4099 1059.7527 1063.8507 1077.1928 1095.2026 1099.2951 1102.7568 1131.1314 1154.3720 1156.7587 1160.0855 1183.4273 1193.4430 1195.0846 1205.5454 1209.5787 1221.0455 1226.9949 1240.0825 1256.8589 1265.8576 1279.2288 1286.9079 1291.2163 1296.4811 1315.4849 1321.3315 1329.8341 1334.2174 1345.6348 1353.2626 1357.4273 1364.1977 1377.4479 1382.8182 1389.0612 1401.4145 1438.9173 1443.9255 1447.2150 1466.3499 1467.3877 1473.8488 1497.2773 1498.6709 1514.6366 1532.9014 1543.2322 1551.6937 1581.4749 1583.3647 1622.3320 1632.9076 1644.6325 1651.2921 1670.7600 2914.6318 2930.9388 2966.9919 2989.0659 2995.2493 3001.2373 3007.8832 3014.4217 3035.1571 3040.2067 3085.0060 3100.9175 3116.4811 3146.0406 3154.5618 3165.7119 3471.1681 3513.3907 3518.8698 3524.6056 3534.5810 3548.2389 3699.0689
redmass: 6.1120 6.0013 7.6618 9.7092 5.4070 6.8616 5.3783 10.4878 6.4487 5.4269 6.2952 4.4257 2.8272 3.4924 3.0653 4.8408 5.4613 4.3864 4.4251 6.8615 6.9054 4.9588 5.6114 3.9003 1.4447 1.9299 5.8182 4.4117 4.6670 5.1093 6.0835 4.3674 6.2843 2.9104 4.7861 5.5490 3.5937 3.1862 2.6407 2.7256 1.3707 1.8184 2.9613 2.9943 1.2686 4.3556 3.7894 2.6595 1.7323 3.0034 4.5140 3.7725 5.8756 1.6748 1.3526 5.4550 3.6971 6.9455 3.8594 5.3409 4.6855 10.4575 3.7420 3.3793 1.9983 1.5209 3.1717 5.1242 1.6674 4.0308 4.5610 4.4531 1.5410 2.5537 1.7575 3.3649 4.5864 1.3549 2.6772 2.8601 2.4685 2.7665 2.7118 2.5930 2.1554 1.5031 2.4806 2.6346 2.6400 2.4268 1.4990 3.4030 1.6994 1.1049 1.5904 4.2566 1.1785 2.1874 1.3625 1.4460 3.3012 1.4187 1.5930 1.6554 1.5976 1.3537 1.5877 1.3569 1.4778 1.3739 1.4783 1.5238 1.7749 2.4142 1.8111 1.9291 1.7652 3.3337 2.6576 3.1724 1.1409 3.4336 1.6982 1.2873 1.1538 1.9705 3.5822 1.2226 1.1149 3.7293 5.7990 9.9922 1.8253 6.8974 2.1106 5.7028 8.3623 5.7593 8.2229 1.0699 1.0823 1.0562 1.0613 1.0812 1.0904 1.0666 1.1089 1.0629 1.0956 1.1035 1.1037 1.0881 1.0876 1.0939 1.0966 1.0762 1.0639 1.0644 1.0768 1.0763 1.0463 1.1046
irintensity: 8.3219 0.0614 0.2030 0.6007 0.4652 1.4700 0.2508 0.1429 5.8068 0.9383 3.3136 1.6712 1.5561 5.4459 0.3318 0.6319 7.5781 2.3995 0.7231 27.9769 3.1904 0.8508 7.7556 9.6782 43.8596 61.2037 0.3563 14.6825 9.5583 8.5216 4.0097 6.5068 15.7954 0.3583 30.7506 11.4680 11.3370 94.1751 114.3465 88.1192 218.6897 31.2642 40.5707 44.9462 66.6997 5.8031 54.4085 136.7345 15.3024 20.8451 15.2154 26.8613 3.9347 107.6371 128.5861 3.7657 14.6096 12.0801 27.5224 18.8374 9.9435 8.0114 24.3431 6.9119 38.8869 18.2479 22.0034 3.8247 43.9920 5.8303 3.2061 15.6793 5.0265 12.0996 5.7235 2.4504 6.7628 2.4908 6.4145 32.3487 12.3809 116.4829 293.5378 51.9913 135.6282 4.5503 4.9463 17.3293 5.8342 82.8280 11.0372 1.5966 5.3545 12.0004 4.2449 8.9225 4.0374 164.2870 95.6533 19.5079 19.4909 19.3997 27.4895 115.5730 76.8689 2.8936 39.2698 20.8298 87.0461 66.1779 6.3275 51.0159 44.7216 403.9861 13.6239 85.2254 59.6999 80.7734 334.6667 33.3587 49.8109 19.3424 13.9366 7.2684 49.9832 689.7990 140.5267 16.2628 9.7389 233.3668 22.3090 614.4720 87.6526 178.0304 761.8669 255.9694 159.5424 103.9109 215.2717 76.3917 43.7651 15.4240 10.6257 22.9287 33.3460 37.0131 39.9133 10.6257 6.3672 24.2325 10.8408 27.5803 4.4189 17.3314 10.4482 2.4690 20.9424 51.7913 44.2239 25.4197 113.0727 39.7686
temp: 298.150 k
press: 1.00000 atm
elementType: 8 8 8 8 8 8 7 7 7 7 7 7 7 6 6 6 6 6 6 6 6 6 6 6 6 6 6 6 6 6 6 6 6 1 1 1 1 1 1 1 1 1 1 1 1 1 1 1 1 1 1 1 1 1 1 1
symmnumber: 1
zpe: 1131829.9 jmol-1
zpe.correction: 0.431091 hartree
zpe.thermalcorrener: 0.461661 hartree
zpe.thermalcorrenthalpy: 0.462605 hartree
zpe.thermalcorrgfe: 0.364083 hartree
zpe.sumelectzpe: -1608.155700 hartree
zpe.sumelectthermal: -1608.125130 hartree
zpe.sumelectthermalent: -1608.124186 hartree
zpe.sumelectthermalfe: -1608.222708 hartree
dipole: 8.2091 11.9197 0.9969
dipole: 14.5073
quadrupole: -98.4380 -203.6494 -189.3905
quadrupole: 20.4207 17.4166 0.8612
quadrupole: 65.3879 -39.8234 -25.5645 20.4207 17.4166 0.8612
hfenergy: -1608.5867909 hartree
pointgroup: C01 [X(C20H23N7O6)]
dipole: -3.2371907 2.7961779 -3.7787513 debye
polarizability: 491.3881766|6.0821554|213.0599545|29.2494201|-52.3165725|245.1439128 unknown
InChI: InChI=1S/C20H23N7O6/c21-20-24-16-15(18(31)25-20)27-9-26(8-12(27)7-22-16)11-3-1-10(2-4-11)17(30)23-13(19(32)33)5-6-14(28)29/h1-4,12-13,22-24,28,32H,5-9,21H2
charge 0 multiplicity 1
56 atoms
O  -4.966466 -1.226565 2.082283
O  3.996947 -0.973355 2.12739
O  8.121452 1.717609 0.95033
O  6.311993 2.648704 -0.165428
O  7.235908 -2.15345 -3.133832
O  7.743557 -3.119505 -1.08469
N  -4.149337 0.553353 -0.03719
N  -1.859223 0.706447 -0.107849
N  -6.112319 1.086797 -2.054007
N  -7.722258 -0.115413 -0.736952
N  -7.183336 -1.220886 1.319387
N  -9.382088 -1.268867 0.503392
N  4.658005 0.605882 0.569938
C  -3.865969 1.563393 -1.06743
C  -2.331614 1.494837 -1.254371
C  -2.948928 0.054252 0.652231
C  -4.676922 1.220324 -2.361038
C  -5.439725 0.020116 0.071301
C  -6.400196 0.355315 -0.881073
C  -0.519806 0.505809 0.188277
C  -5.822143 -0.855512 1.213886
C  0.509718 1.083105 -0.621445
C  -0.124608 -0.291359 1.311895
C  -8.059644 -0.867214 0.386411
C  1.863901 0.88853 -0.304655
C  1.231267 -0.476951 1.609376
C  2.255671 0.113409 0.820334
C  3.672982 -0.132053 1.222529
C  6.064795 0.453576 0.950119
C  6.728866 -0.831689 0.365698
C  6.684289 -0.877061 -1.170916
C  6.799786 1.714691 0.514502
C  7.272559 -2.157228 -1.727763
H  -4.177827 2.57414 -0.726281
H  -2.069069 1.006923 -2.220187
H  -1.881897 2.506468 -1.257246
H  -2.884139 -1.050488 0.609499
H  -2.922832 0.348539 1.71914
H  -4.297117 0.265608 -2.769623
H  -4.541378 2.003521 -3.126091
H  -6.693226 1.910713 -2.240564
H  -8.329699 -0.080799 -1.557859
H  0.248981 1.67374 -1.504984
H  -0.881424 -0.761104 1.947265
H  2.612199 1.333052 -0.972499
H  1.536414 -1.0881 2.465298
H  -10.139988 -0.828121 -0.011344
H  -9.596743 -1.845398 1.314078
H  6.132749 0.365785 2.053229
H  4.428697 1.406216 -0.024761
H  7.770725 -0.886715 0.725716
H  6.187351 -1.693907 0.789458
H  5.64129 -0.793635 -1.532483
H  7.232383 -0.030868 -1.630489
H  8.572227 2.552194 0.648233
H  7.623108 -3.007407 -3.469448
