program: Gaussian 09
title: 000036054
version: EM64L-G09RevD.01
frameworkgroup: C1[X(C9H20N4)]
method: RPBEPBE
basis: SDD
operation: Freq
keyword: #pfreq=noraman
keyword: PBEPBE/SDD
title: #p freq=noraman PBEPBE/SDD
converged: YES YES NO NO
title: Mulliken charges:
elementType: N N N N C C C C C C C C C H H H H H H H H H H H H H H H H H H H H
charge: -0.365202 -0.098110 -0.635953 -0.659287 -0.049002 -0.380396 -0.444055 -0.355902 -0.368654 -0.369166 -0.393523 -0.533075 0.202939 0.195201 0.230863 0.190016 0.204699 0.189117 0.221296 0.179370 0.184049 0.188985 0.179817 0.194866 0.195801 0.195669 0.241046 0.224229 0.180578 0.317375 0.290901 0.307988 0.337518
chargesum: 0.00000
title: Mulliken charges with hydrogens summed into heavy atoms:
elementType: N N N N C C C C C C C C C
charge: -0.124155 -0.098110 -0.027677 -0.013780 0.146200 0.040483 -0.050239 0.044764 0.004380 0.005517 -0.002053 -0.128267 0.202939
polarizability: 1.66892544e+02 -5.49169907e+00 1.07587519e+02 -1.08261622e+00 -3.99638682e+00 1.07109115e+02
1716.lowfreq: -19.7017 -3.3496 -0.0005 -0.0003 0.0003 7.8018 27.4701 43.7246 68.6990
frequency: 26.9608 43.5783 68.5050 112.3918 165.8719 188.8221 220.1197 236.7046 240.4878 275.8824 290.6350 343.4866 355.8306 373.0973 399.3646 418.5460 432.2727 443.8080 468.1234 500.7078 537.6238 562.3003 578.4299 631.1528 678.7735 718.9272 768.9110 784.4408 820.0965 867.1588 875.6351 899.2608 927.0593 961.9275 987.8773 1001.0396 1020.5681 1031.3106 1033.5316 1047.2272 1115.5045 1130.8884 1138.4890 1148.4455 1170.4594 1183.0618 1201.0316 1215.4650 1242.3396 1251.0940 1280.2106 1281.2004 1308.5832 1326.5747 1335.5276 1346.9351 1349.8105 1357.4926 1362.3561 1374.7004 1378.5634 1406.9138 1446.1100 1447.4188 1451.5787 1457.9055 1461.7231 1467.3333 1477.0270 1483.4363 1600.3807 1612.2868 1672.6774 2840.0970 2852.4623 2930.4014 2937.4887 2949.9057 2953.9749 2962.0340 2974.0894 2987.5795 2992.8583 3007.0075 3011.2047 3023.8287 3041.9820 3052.7323 3456.5965 3522.1079 3549.5217 3670.3954 3694.5262
redmass: 3.9800 3.6429 3.3748 3.3470 3.2672 2.4324 2.8692 3.3994 2.5384 2.1266 2.0496 2.3992 2.0105 1.2470 1.2861 1.8813 1.1899 1.9246 1.7652 2.1064 2.0495 1.4707 2.0134 1.7602 5.1969 2.4625 1.6830 2.4591 2.5506 1.8556 1.8157 4.5467 2.1497 1.6548 2.3079 2.3804 2.3283 1.4782 1.7651 1.8835 2.1902 2.2681 1.9647 1.6059 1.4725 1.7947 1.2990 1.5879 1.2624 1.2701 1.1359 1.1560 1.2052 1.4634 1.3075 1.3595 1.3884 1.3746 1.4066 1.4490 1.3690 4.3062 1.1119 1.0888 1.0909 1.0906 1.1694 1.1255 1.1039 1.0831 1.2171 1.2707 3.8263 1.0801 1.0658 1.0608 1.0914 1.0614 1.0625 1.0630 1.0680 1.0676 1.0971 1.0942 1.0961 1.1008 1.0985 1.0969 1.0749 1.0449 1.0450 1.1017 1.1031
irintensity: 3.3946 1.1993 0.7652 2.3709 2.1304 0.6032 2.2353 5.9809 6.9124 2.2404 4.8045 20.2133 1.0912 93.5411 203.1936 18.5155 84.3220 12.8383 24.0806 8.4061 24.3345 231.0853 31.1320 35.0723 77.7241 14.6407 8.5580 2.3994 6.1202 6.5342 0.5053 6.1813 4.2270 0.9118 2.1764 13.4812 1.8197 8.8906 5.7512 1.2357 1.1839 1.1905 40.1826 11.7248 0.2440 2.7906 1.6077 25.2869 2.6070 4.7670 5.5848 8.8163 46.7292 1.9033 3.1527 4.2057 4.8597 2.4322 1.3783 8.9351 2.1108 114.7505 23.5736 5.8418 18.1630 15.4983 17.3298 12.7219 9.0413 26.1479 141.1064 71.9532 613.1395 99.3965 78.2236 51.2202 72.3973 44.8821 12.3492 53.4275 84.7353 14.8916 73.3944 90.7664 24.9751 100.7110 31.3698 59.8395 2.1327 19.2806 15.9223 18.7091 19.6429
temp: 298.150 k
press: 1.00000 atm
elementType: 7 7 7 7 6 6 6 6 6 6 6 6 6 1 1 1 1 1 1 1 1 1 1 1 1 1 1 1 1 1 1 1 1
symmnumber: 1
zpe: 772983.6 jmol-1
zpe.correction: 0.294414 hartree
zpe.thermalcorrener: 0.308773 hartree
zpe.thermalcorrenthalpy: 0.309717 hartree
zpe.thermalcorrgfe: 0.253236 hartree
zpe.sumelectzpe: -572.874855 hartree
zpe.sumelectthermal: -572.860496 hartree
zpe.sumelectthermalent: -572.859552 hartree
zpe.sumelectthermalfe: -572.916033 hartree
dipole: -2.8835 -1.0553 1.4098
dipole: 3.3787
quadrupole: -63.5963 -78.7832 -78.8905
quadrupole: -2.7345 -7.0162 -3.8301
quadrupole: 10.1603 -5.0265 -5.1338 -2.7345 -7.0162 -3.8301
hfenergy: -573.1692685 hartree
pointgroup: C01 [X(C9H20N4)]
dipole: -1.1259874 0.3655599 -0.6045879 debye
polarizability: 166.9201668|5.3507447|106.7791479|1.2175154|-3.9105704|107.889864 unknown
InChI: InChI=1S/C9H20N4/c10-9(11)13-7-8-5-3-1-2-4-6-12-8/h8,12H,1-7,10-11H2
charge 0 multiplicity 1
33 atoms
N  1.195344 1.348499 -0.262473
N  -2.229186 -0.024736 0.415906
N  -4.539594 -0.36064 0.698219
N  -3.786757 0.33334 -1.415237
C  0.141309 0.666474 0.529599
C  0.601429 -0.687832 1.120195
C  1.040316 -1.797549 0.134074
C  2.236882 -1.476183 -0.802483
C  3.483678 -0.867954 -0.093188
C  3.643377 0.664653 -0.262318
C  2.529205 1.549619 0.352519
C  -1.10687 0.513277 -0.373721
C  -3.434841 -0.015815 -0.099472
H  -0.182199 1.283955 1.40735
H  -0.258225 -1.062628 1.70812
H  1.416825 -0.499546 1.846142
H  0.17384 -2.102564 -0.486794
H  1.300698 -2.688232 0.744301
H  1.903527 -0.774529 -1.587636
H  2.526204 -2.420075 -1.308694
H  3.46689 -1.124981 0.986621
H  4.400473 -1.341018 -0.499249
H  4.610898 0.976466 0.187324
H  3.70148 0.895152 -1.345566
H  2.487664 1.380793 1.450907
H  2.832642 2.608966 0.220089
H  0.832395 2.208193 -0.690955
H  -0.834108 -0.149664 -1.225846
H  -1.346219 1.515589 -0.812906
H  -4.310112 -0.565909 1.669677
H  -5.313485 -0.875269 0.279625
H  -4.724191 0.667081 -1.627252
H  -3.050289 0.508766 -2.092777
