program: Gaussian 09
title: 000036060
version: EM64L-G09RevD.01
frameworkgroup: C1[X(C15H17NO)]
method: RPBEPBE
basis: SDD
operation: Freq
keyword: #p
keyword: freq=noraman
keyword: PBEPBE/SDD
title: #p freq=noraman PBEPBE/SDD
converged: YES YES NO NO
title: Mulliken charges:
elementType: O N C C C C C C C C C C C C C C C H H H H H H H H H H H H H H H H H
charge: -0.298709 -0.588848 -0.272754 0.480782 0.363018 -0.198998 -0.451243 -0.387354 -0.351731 -0.425727 -0.413156 -0.225380 -0.229389 -0.228753 -0.217794 -0.243288 -0.248733 0.205531 0.194955 0.203249 0.234654 0.242868 0.255335 0.278674 0.216865 0.204908 0.226378 0.223340 0.226036 0.222682 0.228137 0.225409 0.266824 0.282211
chargesum: 0.00000
title: Mulliken charges with hydrogens summed into heavy atoms:
elementType: O N C C C C C C C C C C C C C C C
charge: -0.298709 -0.039813 -0.067223 0.480782 0.363018 0.199206 -0.216589 -0.144486 -0.096396 -0.147053 0.008617 0.000998 -0.006049 -0.002717 0.004889 -0.015150 -0.023324
polarizability: 1.82797316e+02 -1.80342243e+01 1.84801728e+02 1.03224561e+01 -9.37512611e+00 1.26352595e+02
1716.lowfreq: -10.8563 -6.5564 -3.7113 -0.0008 -0.0007 -0.0001 17.2232 28.2287 38.1929
frequency: 17.0709 28.0673 38.1900 47.5422 62.0673 75.2929 116.9986 180.0803 191.8561 205.2864 213.7638 266.7537 268.5438 306.6596 401.5866 404.1629 415.8522 460.1845 472.3121 562.1822 580.8516 606.5367 614.9603 616.6209 652.7924 705.0759 705.5249 741.0146 769.8635 808.9538 828.1658 855.3565 859.8278 861.4816 920.7632 934.3306 943.6927 966.1976 977.8197 985.0370 990.0993 990.6838 996.3232 999.2876 1022.9578 1027.0140 1032.8081 1070.4649 1079.6443 1084.8736 1116.1574 1151.8412 1170.0009 1171.8315 1180.6047 1185.0578 1189.3608 1210.3250 1244.3962 1268.5773 1281.5701 1292.2418 1318.2574 1335.3469 1348.0890 1382.2587 1385.8457 1396.9247 1433.8534 1441.9225 1476.2868 1480.1095 1481.8094 1490.6497 1591.4553 1594.6805 1610.2421 1614.5523 1641.5804 2900.5943 2916.2482 2941.6566 2998.6855 3051.6236 3111.9102 3119.0196 3124.6140 3127.4416 3136.6695 3140.5329 3148.1960 3157.4868 3162.9632 3177.0554 3480.3081 3609.1820
redmass: 3.6269 3.8319 4.1394 1.7765 4.7367 4.4206 3.0223 2.2696 1.9876 2.6599 3.7062 4.3131 4.5812 4.8029 2.8038 2.8718 3.8007 3.5272 4.1276 3.5226 1.4454 4.8940 6.3057 6.4037 4.9465 2.0834 1.6591 1.7974 2.0439 1.1625 2.9400 1.2704 2.5304 1.3658 1.9575 1.7989 2.2810 1.5326 1.3940 1.3824 5.8205 6.2353 1.3246 1.3169 2.7193 2.2442 3.6556 2.7649 1.5902 1.7466 2.6099 1.2466 1.0633 1.0640 1.7259 1.1173 1.5070 1.8913 1.3277 1.6919 1.1025 1.3086 1.2965 1.2943 1.3407 7.6127 6.3715 1.5327 2.2191 2.1246 1.0936 2.2098 2.2833 1.0865 6.2399 6.1574 6.0531 6.0839 1.0940 1.0819 1.0700 1.0557 1.1040 1.0943 1.0876 1.0846 1.0859 1.0883 1.0911 1.0940 1.0959 1.0990 1.1014 1.0953 1.0452 1.0982
irintensity: 0.0399 0.0268 1.1102 1.1387 0.7032 0.3267 1.2162 6.7535 42.1677 14.9530 14.0972 2.3697 4.6338 0.5643 0.2664 0.4891 11.4849 7.1755 1.4979 44.2250 187.2689 22.4224 2.7814 0.6078 17.8483 39.7539 58.2699 67.1218 43.5420 0.7682 3.7992 0.1585 4.1579 0.1475 10.5801 5.8830 7.5278 1.6229 0.0148 0.1450 0.8654 0.5035 1.0635 0.8190 54.4387 41.5862 96.4057 26.4474 5.0550 23.6760 13.6583 4.7457 0.9287 0.2857 8.9167 3.6546 5.3646 3.8997 3.4788 10.6414 9.5328 18.6173 2.3527 2.1397 0.3522 0.7871 0.3864 5.2434 12.3767 12.9049 5.3599 3.8290 25.0521 6.2348 0.9940 0.2595 3.7000 5.9080 41.0379 37.1249 61.5092 61.6597 37.4256 50.4010 8.3564 2.1434 0.0330 5.0870 16.3692 36.3476 33.7900 32.0841 24.0882 8.4148 0.3118 1.4839
temp: 298.150 k
press: 1.00000 atm
elementType: 8 7 6 6 6 6 6 6 6 6 6 6 6 6 6 6 6 1 1 1 1 1 1 1 1 1 1 1 1 1 1 1 1 1
symmnumber: 1
zpe: 740210.3 jmol-1
zpe.correction: 0.281931 hartree
zpe.thermalcorrener: 0.298135 hartree
zpe.thermalcorrenthalpy: 0.299079 hartree
zpe.thermalcorrgfe: 0.235082 hartree
zpe.sumelectzpe: -710.509674 hartree
zpe.sumelectthermal: -710.493470 hartree
zpe.sumelectthermalent: -710.492526 hartree
zpe.sumelectthermalfe: -710.556523 hartree
dipole: -1.4697 0.4400 0.4238
dipole: 1.5916
quadrupole: -92.0140 -90.3151 -98.8024
quadrupole: 1.3879 -2.9380 -4.0139
quadrupole: 1.6965 3.3954 -5.0919 1.3879 -2.9380 -4.0139
hfenergy: -710.7916052 hartree
pointgroup: C01 [X(C15H17N1O1)]
dipole: -0.6014723 -0.136836 -0.1078777 debye
polarizability: 182.9180387|16.4616928|181.3075234|-16.7281006|-12.4289783|129.726077 unknown
InChI: InChI=1S/C15H17NO/c16-11-12-17-15(13-7-3-1-4-8-13)14-9-5-2-6-10-14/h1-10,15H,11-12,16H2
charge 0 multiplicity 1
34 atoms
O  -0.690163 1.496365 -0.064834
N  -3.973937 3.224002 0.246426
C  0.021066 0.382357 0.592204
C  -0.659519 -0.958889 0.308464
C  1.481721 0.438204 0.131399
C  -2.035333 1.730776 0.479714
C  -1.21298 -1.725844 1.360691
C  2.350241 -0.645984 0.41678
C  -0.767629 -1.434325 -1.023459
C  1.99685 1.577616 -0.532246
C  -2.593068 2.982081 -0.213196
C  -1.856769 -2.957306 1.09376
C  3.71238 -0.590266 0.049509
C  -1.414041 -2.658412 -1.294436
C  3.359412 1.629522 -0.906716
C  -1.958379 -3.426051 -0.235303
C  4.223181 0.549362 -0.615123
H  -0.007591 0.553284 1.69499
H  -2.689482 0.853862 0.284537
H  -1.98998 1.893175 1.577397
H  -1.14068 -1.359362 2.392988
H  1.956597 -1.538801 0.917152
H  -0.343398 -0.835803 -1.837543
H  1.319957 2.406997 -0.752912
H  -1.970662 3.850227 0.069001
H  -2.486785 2.848948 -1.314477
H  -2.2791 -3.544476 1.917041
H  4.372375 -1.435328 0.276525
H  -1.492566 -3.018623 -2.326579
H  3.746233 2.514799 -1.424764
H  -2.456995 -4.378958 -0.446103
H  5.279593 0.592372 -0.903886
H  -4.663809 2.551744 -0.099798
H  -4.294139 4.190933 0.162898
