program: Gaussian 09
title: 000036022
version: EM64L-G09RevD.01
frameworkgroup: C1[X(C7H7ClO2)]
method: RPBEPBE
basis: SDD
operation: Freq
keyword: #p
keyword: freq=noraman
keyword: PBEPBE/SDD
title: #p freq=noraman PBEPBE/SDD
converged: NO NO NO NO
title: Mulliken charges:
elementType: Cl O O C C C C C C C H H H H H H H
charge: -0.073348 -0.431343 -0.492522 0.416648 -0.005669 -0.414854 0.222433 -0.776286 -0.059512 -0.364094 0.260315 0.243354 0.216203 0.243403 0.251609 0.386732 0.376931
chargesum: 0.00000
title: Mulliken charges with hydrogens summed into heavy atoms:
elementType: Cl O O C C C C C C C
charge: -0.073348 -0.044612 -0.115591 0.416648 -0.005669 -0.154539 0.222433 -0.073326 -0.059512 -0.112486
polarizability: 1.26931363e+02 -5.49022404e-01 1.04741181e+02 1.54631171e-03 7.02081071e-03 4.10611905e+01
1716.lowfreq: -2.7422 -0.0022 0.0010 0.0012 7.8769 8.1890 73.6611 120.4781 162.7006
frequency: 73.6244 120.4726 162.6986 208.9556 237.4581 256.2630 269.2329 288.9634 337.3969 355.9781 490.3931 503.7146 513.0357 516.0622 564.9679 576.9913 715.1767 722.4126 811.9553 850.4538 857.5860 953.3920 1012.2064 1045.2799 1087.8338 1118.4972 1205.6358 1222.5889 1266.4466 1313.4793 1397.6319 1406.3686 1419.5490 1454.9511 1472.2768 1500.7089 1598.8006 1627.1295 2985.5385 3064.0641 3097.5739 3151.5254 3162.8978 3518.6648 3622.8981
redmass: 1.0181 8.0674 4.3570 6.3016 4.0449 1.1044 3.3667 5.2330 6.8121 14.7717 4.8253 1.1169 3.5206 6.2216 4.0297 4.7232 4.4789 5.6962 1.4539 8.5319 1.3425 3.1500 1.8251 1.5082 1.7675 1.3308 1.6038 2.6868 2.0484 1.9583 1.5617 2.9876 3.3807 1.0446 1.2794 2.8518 6.7989 7.4009 1.0365 1.0969 1.1005 1.0929 1.0926 1.0648 1.0667
irintensity: 0.0003 0.5321 6.2217 0.8437 4.9667 173.8154 9.6714 4.8557 0.3737 2.4237 1.8180 130.8590 1.3384 8.8562 15.4304 19.0202 4.3651 28.3600 35.5138 39.8952 21.0964 66.1449 81.4926 7.9743 26.2468 74.0758 137.4394 60.5195 131.2633 43.2863 31.2811 24.4088 18.4341 13.2865 14.2692 109.9954 12.0461 37.6755 22.4371 14.9880 17.2093 2.6453 1.1463 80.2461 57.5889
temp: 298.150 k
press: 1.00000 atm
elementType: 17 8 8 6 6 6 6 6 6 6 1 1 1 1 1 1 1
symmnumber: 1
zpe: 323827.5 jmol-1
zpe.correction: 0.123339 hartree
zpe.thermalcorrener: 0.133335 hartree
zpe.thermalcorrenthalpy: 0.134279 hartree
zpe.thermalcorrgfe: 0.087943 hartree
zpe.sumelectzpe: -880.711766 hartree
zpe.sumelectthermal: -880.701770 hartree
zpe.sumelectthermalent: -880.700826 hartree
zpe.sumelectthermalfe: -880.747162 hartree
dipole: -0.9560 -2.0979 -0.0002
dipole: 2.3054
quadrupole: -72.2016 -49.7595 -68.2577
quadrupole: 1.3591 -0.0001 0.0022
quadrupole: -8.7953 13.6468 -4.8514 1.3591 -0.0001 0.0022
hfenergy: -880.8351055 hartree
pointgroup: C01 [X(C7H7Cl1O2)]
dipole: -0.361327 -0.8319388 -0.0000639 debye
dipolederiv: -0.8315893 -0.0138142 -0.0000385 -0.0108372 -0.1453143 -0.0000017 -0.0000176 0.0000019 -0.0775872 -1.3760682 -0.1947476 -0.0000648 -0.1656765 -0.1548705 0.000022 -0.0000285 0.0000107 -0.3970031 -0.4412732 -0.5394642 -0.0000606 -0.5240401 -1.1596913 -0.0000655 -0.0000525 -0.0000504 -0.4411935 0.0793718 -0.077245 -0.0000231 -0.2330687 0.307189 0.0000796 -0.0001462 0.0003002 -0.0257106 1.1961661 0.2676755 0.0000335 0.070944 -0.307473 -0.0000197 0.0000295 -0.0000141 0.0132387 -0.3329601 0.0242868 -0.000006 0.0780213 -0.0993344 0.0000257 0.0000373 -0.0000195 -0.1642355 0.1647229 0.3030802 0.0000277 0.5539175 1.0801043 0.000134 0.0000497 0.0000773 0.049274 -0.0600357 0.1647999 -0.000048 0.1003593 0.0002056 -0.000105 0.0000944 -0.0004626 0.0587383 1.1240606 0.0540555 0.0000445 -0.0409107 0.1844347 -0.0000019 0.000036 0.0000018 -0.0523134 -0.3445808 -0.114942 0.0000098 0.0149545 -0.1746187 -0.0000188 -0.0000059 -0.0000117 -0.1674022 0.0747937 -0.0487788 -0.0000177 -0.0592566 -0.0210484 0.0000012 -0.0000101 0.0000274 0.1691371 0.0278208 0.0428744 0.1027733 0.0241267 0.0459791 0.018341 0.1094045 -0.0385485 -0.030143 0.0056803 -0.1569591 0.0002978 -0.0516926 -0.0767318 0.0002771 0.0001334 0.0003844 0.1076583 0.0273351 0.0426866 -0.1029538 0.0237605 0.0461979 -0.0186177 -0.1095242 0.0383442 -0.0294349 0.0704776 0.0482986 -0.0000024 0.0502208 -0.0375251 -0.0000127 -0.0000067 -0.0000118 0.1888016 0.4403294 0.036719 0.0000086 0.0459659 0.1742943 -0.0000327 -0.0000052 -0.0000144 0.3878058 0.1757492 0.1614742 0.0000196 0.123212 0.3382025 -0.0000048 0.0000121 -0.0000151 0.4103698 unknown
polarizability: 126.9438822|-0.1531549|104.7286614|0.0014209|0.0070473|41.0611905 unknown
InChI: InChI=1S/C7H7ClO2/c1-4-2-5(8)3-6(9)7(4)10/h2-3,9-10H,1H3
charge 0 multiplicity 1
17 atoms
Cl 3.502754 0.112189 0.000229
O  -2.513937 -0.102398 -0.000015
O  -1.143094 -2.414316 -0.000146
C  -0.471384 1.217255 0.000133
C  -1.113294 -0.044571 0.000042
C  0.946915 1.248031 0.000154
C  -0.353096 -1.24165 -0.000027
C  -1.302696 2.481814 0.000187
C  1.678611 0.046145 0.000149
C  1.05387 -1.216525 0.000038
H  1.468211 2.209786 0.00017
H  -1.963781 2.51886 0.885458
H  -0.661975 3.379383 -0.001565
H  -1.966434 2.51715 -0.883136
H  1.644077 -2.139032 0.0000
H  -2.793978 -1.056427 -0.000129
H  -0.596269 -3.235794 -0.000242
