program: Gaussian 09
title: 000002833
version: EM64L-G09RevD.01
frameworkgroup: C1[X(C22H25NO6)]
method: RPBEPBE
basis: SDD
operation: Freq
keyword: #p
keyword: freq=noraman
keyword: PBEPBE/SDD
title: #p freq=noraman PBEPBE/SDD
converged: YES YES NO NO
title: Mulliken charges:
elementType: O O O O O O N C C C C C C C C C C C C C C C C C C C C C C H H H H H H H H H H H H H H H H H H H H H H H H H
charge: -0.276878 -0.297037 -0.304841 -0.267470 -0.283730 -0.273515 -0.379982 -0.360324 -0.414942 -0.647092 0.517215 0.502155 -0.065620 0.337149 0.081037 -0.663449 -0.558895 -0.303950 0.013969 0.246891 0.059917 0.233487 -0.348394 0.208539 -0.776944 -0.495867 -0.530399 -0.526735 -0.507288 0.277593 0.226747 0.234405 0.230770 0.237535 0.333886 0.267860 0.243872 0.235827 0.238178 0.205983 0.253878 0.252957 0.254202 0.199474 0.237913 0.234421 0.210110 0.267775 0.225554 0.252293 0.231964 0.224515 0.223217 0.282060
chargesum: 0.00000
title: Mulliken charges with hydrogens summed into heavy atoms:
elementType: O O O O O O N C C C C C C C C C C C C C C C C C C C C C C
charge: -0.276878 -0.297037 -0.304841 -0.267470 -0.283730 -0.273515 -0.046096 -0.082732 0.046210 -0.178787 0.517215 0.502155 -0.065620 0.337149 0.081037 -0.395589 -0.315024 -0.068123 0.013969 0.246891 0.059917 0.233487 -0.110216 0.208539 -0.064126 0.195723 0.181907 0.183077 0.222504
polarizability: 4.32451082e+02 -6.71075933e+00 2.48571406e+02 7.69253012e+00 -1.27300090e+01 2.21176779e+02
1716.lowfreq: -1.6116 -0.0011 -0.0007 -0.0004 6.2020 8.2549 16.1449 24.6541 31.5741
frequency: 15.7177 24.5243 31.5187 35.6352 47.2954 54.1325 59.2350 71.3626 78.8835 87.2602 95.8091 108.1002 120.1698 129.0740 145.6499 150.9261 160.4253 162.6304 168.9413 181.3950 188.1525 203.5504 216.6572 225.8074 251.9149 258.0341 263.3144 296.2208 304.9930 326.9480 335.5164 351.9659 356.3291 368.9853 387.5792 400.0971 411.6209 431.9012 455.0184 464.5191 483.0059 498.8569 525.2798 538.1684 561.0489 575.1761 585.2544 606.4126 609.5144 626.3124 656.0249 678.3430 700.4060 724.6858 731.9216 737.5293 770.0582 782.5467 792.2469 838.1264 861.4991 868.9681 875.6805 882.5133 906.9852 917.9250 921.8299 953.7849 955.1202 972.1251 978.2933 996.0012 1012.1562 1040.7262 1047.0562 1070.6142 1076.2494 1096.2049 1103.4263 1105.7637 1109.4300 1112.7401 1113.3930 1124.9527 1150.0820 1151.2180 1155.1360 1155.8897 1173.7747 1203.4235 1222.4714 1234.1102 1238.5325 1252.0706 1273.8503 1282.7617 1305.3201 1325.4172 1334.6974 1341.7662 1346.6164 1363.9931 1381.4550 1384.8917 1386.0856 1416.6755 1423.6161 1434.1657 1436.3701 1445.4720 1446.3970 1450.0283 1450.3400 1453.5170 1455.7915 1458.6431 1461.4178 1464.7562 1468.8045 1472.0515 1473.9409 1475.0146 1477.6507 1487.0430 1487.6005 1523.3819 1549.9744 1578.2753 1590.3243 1602.9901 1618.3441 2967.3407 2973.1046 2975.0571 2986.2297 2992.8490 2993.3450 3002.6574 3037.9718 3046.0518 3060.3293 3069.5107 3071.5642 3089.7442 3093.7174 3100.5600 3104.5864 3111.1768 3116.1328 3123.1832 3123.8316 3128.9513 3141.4492 3152.5559 3155.4366 3557.6627
redmass: 7.4185 5.7556 5.5101 4.7935 3.6794 3.1785 3.1558 1.9638 2.8680 1.2368 2.6209 2.0462 3.0244 2.3466 3.5752 2.1719 1.3818 1.2651 3.6043 2.0115 1.8727 3.9001 3.4348 5.7269 3.3819 4.3211 4.3632 5.3257 5.0131 2.8935 5.4246 5.0438 4.9634 4.7502 4.5593 3.8676 4.2000 4.3487 5.7379 6.2303 5.7097 3.3045 3.2335 5.5278 2.2668 4.4908 3.2234 5.1247 2.1687 3.9296 5.0100 5.4222 5.8724 3.9124 4.1205 5.4776 5.3455 5.1826 4.0516 2.8405 1.4847 5.4995 2.1805 2.2275 4.6384 1.6584 8.1090 7.1686 4.0522 2.1696 1.4064 3.9433 1.9506 1.6542 3.3722 3.6780 2.8859 3.2463 1.4174 1.3053 1.7848 1.2588 1.2697 3.1957 1.4655 1.3789 1.5388 1.5423 1.3555 1.8238 1.7313 2.7361 3.1260 1.9842 1.8885 1.3611 2.3374 1.6744 1.6123 5.2233 1.5486 1.7484 2.1871 1.4938 1.4537 1.3476 1.3063 1.5586 1.2714 1.7213 1.8143 1.0540 1.1572 1.2893 1.1266 1.0792 1.1760 1.3633 1.0816 1.1952 1.1596 1.1134 1.0654 1.0965 3.3090 4.3600 8.1396 4.8347 7.4624 7.5240 6.1987 1.0334 1.0308 1.0355 1.0599 1.0624 1.0368 1.0312 1.0869 1.0975 1.1028 1.1039 1.1010 1.0953 1.0998 1.0985 1.0871 1.1019 1.0858 1.1027 1.1036 1.1057 1.0912 1.1050 1.0921 1.0773
irintensity: 2.6600 2.3104 3.7332 0.1468 5.2000 4.0554 0.2441 5.0585 7.3785 1.3865 5.6793 1.1970 0.6705 6.3403 0.8170 0.2102 0.8992 0.8694 12.6785 1.1513 4.1057 2.6565 3.3059 3.7510 2.1392 2.4368 7.9994 9.1451 6.2517 1.1248 5.0630 1.3993 2.0448 6.2338 0.8186 3.9721 10.0018 2.6546 17.1428 11.1135 4.1384 12.1964 5.4572 2.2049 46.3872 2.8621 14.3123 0.2397 7.5884 8.3877 18.0677 5.4868 11.1657 18.8419 7.7205 3.3404 0.3559 2.4760 7.5619 9.6438 26.7015 4.8167 28.4709 9.9665 33.1332 14.3800 35.4218 24.1101 6.0871 18.5946 3.8364 88.8510 13.6341 3.8452 117.3154 35.8058 48.8488 33.1161 19.7834 1.2323 9.0708 22.6568 2.7092 6.6087 9.5407 2.8395 30.7524 22.2533 14.9567 32.7469 166.0435 267.3018 37.3725 34.5247 17.2532 6.4947 104.3898 38.8143 49.2660 1.2303 84.6697 80.8504 58.3453 39.0433 30.4207 14.1541 137.7254 44.3445 6.3957 115.0584 24.5742 12.4411 6.6217 31.5520 6.8122 32.3991 23.4652 212.6226 48.9533 50.6736 34.9796 30.2424 15.2944 61.4227 142.4070 74.3879 34.1370 19.8461 15.5954 85.5469 183.4302 65.9847 78.4660 75.7720 18.9886 41.7706 8.1042 91.1395 1.8192 27.8060 35.3581 26.6213 26.1726 38.0331 19.4472 11.6741 2.3362 39.9971 8.1805 25.3609 19.4107 15.0382 6.5133 7.9335 3.7610 58.4036
temp: 298.150 k
press: 1.00000 atm
elementType: 8 8 8 8 8 8 7 6 6 6 6 6 6 6 6 6 6 6 6 6 6 6 6 6 6 6 6 6 6 1 1 1 1 1 1 1 1 1 1 1 1 1 1 1 1 1 1 1 1 1 1 1 1 1
symmnumber: 1
zpe: 1124449.7 jmol-1
zpe.correction: 0.428280 hartree
zpe.thermalcorrener: 0.458211 hartree
zpe.thermalcorrenthalpy: 0.459155 hartree
zpe.thermalcorrgfe: 0.365502 hartree
zpe.sumelectzpe: -1357.206456 hartree
zpe.sumelectthermal: -1357.176525 hartree
zpe.sumelectthermalent: -1357.175581 hartree
zpe.sumelectthermalfe: -1357.269234 hartree
dipole: -6.9052 -4.2842 -1.0486
dipole: 8.1936
quadrupole: -162.4722 -186.2707 -155.1273
quadrupole: -11.5524 -16.5477 -3.5866
quadrupole: 5.4845 -18.3140 12.8294 -11.5524 -16.5477 -3.5866
hfenergy: -1357.6347366 hartree
pointgroup: C01 [X(C22H25N1O6)]
dipole: 2.6225944 -1.8561445 0.261611 debye
polarizability: 432.559653|-4.8444673|249.2045925|-7.9640809|11.7729061|220.4350218 unknown
InChI: InChI=1S/C22H25NO6/c1-12(24)23-16-8-6-13-10-19(27-3)21(28-4)22(29-5)20(13)14-7-9-18(26-2)17(25)11-15(14)16/h7,9-11,16,23H,6,8H2,1-5H3
charge 0 multiplicity 1
54 atoms
O  0.694229 -1.612656 -1.530719
O  3.58196 -1.843826 -1.340607
O  4.885494 -0.673694 0.943123
O  -5.180356 -1.955703 0.346574
O  -5.215767 0.880138 -0.009342
O  -0.73727 4.397021 -0.994311
N  0.26963 2.422072 -0.266479
C  -0.705436 2.189013 0.819806
C  -0.053097 2.23565 2.237081
C  0.515135 0.878046 2.734853
C  -1.542636 0.906874 0.597082
C  1.325693 0.162603 1.66966
C  0.65053 -0.409969 0.54916
C  -0.851679 -0.363812 0.466981
C  1.422427 -1.053644 -0.4748
C  2.730603 0.069707 1.774151
C  -2.91987 1.127259 0.520975
C  -1.492675 -1.603606 0.304393
C  2.842876 -1.1343 -0.364818
C  3.481664 -0.588871 0.783557
C  -4.099328 0.298125 0.272208
C  0.169233 3.5169 -1.114425
C  -2.865519 -1.963059 0.287372
C  -4.028258 -1.185086 0.343992
C  1.231495 3.592272 -2.208911
C  1.229308 -1.60394 -2.906008
C  4.587146 -1.03865 -2.077789
C  5.391073 -2.047256 1.186444
C  -6.502419 -1.427431 0.767234
H  -1.380919 3.058811 0.742498
H  -0.814726 2.583008 2.961382
H  0.744517 3.001549 2.209029
H  1.133803 1.053852 3.633216
H  -0.33086 0.234967 3.045015
H  1.016657 1.74082 -0.407463
H  3.258519 0.485674 2.637735
H  -3.233322 2.179958 0.574365
H  -0.816964 -2.4619 0.215888
H  -3.069813 -3.04054 0.236739
H  1.98327 2.785364 -2.14982
H  1.745336 4.566547 -2.145496
H  0.733784 3.548746 -3.193425
H  1.996279 -2.382466 -3.035794
H  1.651705 -0.611985 -3.158916
H  0.351996 -1.803378 -3.540629
H  5.123615 -1.755059 -2.718345
H  4.080896 -0.278598 -2.70451
H  5.282888 -0.547077 -1.376278
H  4.984539 -2.435596 2.139194
H  5.115326 -2.721932 0.356014
H  6.484706 -1.947941 1.258048
H  -7.146755 -2.319971 0.764976
H  -6.43847 -1.001065 1.783814
H  -6.851993 -0.653968 0.07053
