program: Gaussian 09
title: 000036023
version: EM64L-G09RevD.01
frameworkgroup: C1[X(C8H6BrN)]
method: RPBEPBE
basis: SDD
operation: Freq
keyword: #p
keyword: freq=noraman
keyword: PBEPBE/SDD
title: #p freq=noraman PBEPBE/SDD
converged: YES YES NO NO
title: Mulliken charges:
elementType: Br N C C C C C C C C H H H H H H
charge: 0.011707 -0.011356 0.424267 -0.519983 -0.304129 -0.380081 -0.194573 -0.211509 -0.204134 -0.154499 0.267822 0.268913 0.252125 0.259104 0.239942 0.256385
chargesum: 0.00000
title: Mulliken charges with hydrogens summed into heavy atoms:
elementType: Br N C C C C C C C C
charge: 0.011707 -0.011356 0.424267 0.016751 -0.052004 -0.120977 -0.194573 0.028433 0.052251 -0.154499
polarizability: 1.58133474e+02 9.39680684e+00 9.81463786e+01 -1.07470171e-02 -1.95638985e-01 4.31426137e+01
1716.lowfreq: -11.0109 -9.0859 -1.5449 -0.0006 -0.0005 0.0004 17.9348 107.3467 149.6559
frequency: 17.5736 107.3453 149.6537 173.1597 195.6162 288.6532 348.4613 353.0745 426.8115 430.0958 510.2922 619.5572 659.8132 685.8416 782.9542 808.0007 868.1434 912.1442 954.4272 955.6194 982.9395 990.6627 1068.9456 1097.0214 1185.5670 1196.1262 1209.1210 1278.0691 1304.7787 1376.5311 1418.8143 1437.9564 1464.6110 1575.4482 1607.2475 2207.1401 2983.0769 3031.2606 3141.3116 3145.7991 3158.3973 3177.6907
redmass: 4.7638 9.6503 4.2279 9.4026 3.1820 9.0899 5.7041 3.5555 2.9095 7.8081 4.3184 6.5524 7.1906 2.5667 1.3194 5.5616 1.3796 1.3960 1.8631 4.3062 6.0564 1.3602 2.2992 1.6037 1.1406 1.9638 1.0919 1.6745 1.3011 7.4163 2.5159 1.1022 2.3202 6.4692 6.3254 12.4731 1.0590 1.0991 1.0875 1.0927 1.0939 1.0981
irintensity: 10.0652 5.5627 4.6865 0.4198 2.7867 3.8709 0.0155 0.4802 7.2333 0.2711 0.1692 1.5599 25.2809 21.6139 59.5014 28.4051 1.8238 3.6576 8.9939 2.8516 6.0150 1.4149 20.5164 4.3175 0.4579 10.0234 0.2096 0.9203 0.2437 0.6007 20.7337 24.4200 42.7598 50.9379 31.5383 8.3017 5.1119 1.6225 2.6991 4.1245 4.6013 6.0839
temp: 298.150 k
press: 1.00000 atm
elementType: 35 7 6 6 6 6 6 6 6 6 1 1 1 1 1 1
symmnumber: 1
zpe: 300775.6 jmol-1
zpe.correction: 0.114559 hartree
zpe.thermalcorrener: 0.123767 hartree
zpe.thermalcorrenthalpy: 0.124711 hartree
zpe.thermalcorrgfe: 0.077610 hartree
zpe.sumelectzpe: -375.946149 hartree
zpe.sumelectthermal: -375.936941 hartree
zpe.sumelectthermalent: -375.935997 hartree
zpe.sumelectthermalfe: -375.983098 hartree
dipole: -1.7195 -0.5885 0.1036
dipole: 1.8204
quadrupole: -92.8821 -56.5410 -69.8041
quadrupole: -4.1960 0.4758 -0.0675
quadrupole: -19.8064 16.5347 3.2717 -4.1960 0.4758 -0.0675
hfenergy: -376.0607081 hartree
pointgroup: C01 [X(C8H6Br1N1)]
dipole: -0.5577189 0.4270313 0.139713 debye
dipolederiv: -0.4940435 0.2805626 0.1155525 0.3171893 -0.2716381 -0.1026522 0.1375822 -0.1068579 -0.0859982 -0.3098544 -0.0111646 -0.015578 0.0558773 -0.2165219 0.0142374 0.0213327 0.0057176 -0.2246839 0.4086817 0.0675428 0.0822986 0.1127143 0.0430932 0.0532759 0.0980605 0.0470807 0.0119221 0.0668419 0.0486587 0.0079681 0.0065118 0.0800577 -0.084321 -0.0044623 -0.077286 0.1925548 -0.4679027 0.128687 0.0376169 0.1553794 -0.0910949 0.0301902 0.0541376 0.0278739 -0.097069 -0.1529587 -0.0646271 -0.0382035 -0.1191468 -0.0972744 0.013943 -0.0661768 0.0181634 -0.138256 0.8605941 -0.5499719 -0.2194698 -0.6002872 0.4285433 0.2509299 -0.2490977 0.2565427 0.0137931 0.0973118 -0.0477538 -0.0046237 0.0370041 0.0621838 0.1148849 0.0441399 0.1063324 -0.0644097 -0.2077481 0.2191545 0.1165286 0.1723127 -0.225266 -0.0512422 0.0900178 -0.0464185 -0.1249693 0.0692359 -0.0892048 -0.0343616 -0.1748331 0.0336026 0.0197838 -0.0854286 0.0298661 -0.0332526 -0.0010659 0.0227695 -0.0059191 0.0411809 0.1064201 -0.0200282 -0.0360922 -0.0394989 -0.0292667 -0.0179068 -0.0069523 0.0072621 -0.0154429 -0.0132541 0.0373066 0.0400756 0.0559109 0.1029249 0.1035729 -0.0331961 -0.0245731 -0.0297396 0.0089408 -0.0880233 -0.023073 -0.0889947 0.1018827 0.022364 0.0740483 0.0289841 0.0856133 0.0696561 -0.0429304 0.035975 -0.0438884 0.1382586 0.0553339 -0.0022631 -0.0121783 -0.0158921 -0.0290045 -0.1109499 -0.0203971 -0.1092953 0.0946138 -0.0324561 -0.0362898 -0.0413039 -0.0284414 0.1115561 -0.0344045 -0.0365934 -0.0352481 0.1419554 unknown
polarizability: 145.0757589|-27.0353306|95.9418804|-4.7272596|27.453715|58.4048274 unknown
InChI: InChI=1S/C8H6BrN/c9-8-3-1-2-7(6-8)4-5-10/h1-3,6H,4H2
charge 0 multiplicity 1
16 atoms
Br -3.475812 1.490121 0.832172
N  3.832099 -1.227028 0.083656
C  0.452703 -0.052931 0.33882
C  1.851282 0.424361 0.751737
C  -0.654191 0.759385 0.695533
C  0.235983 -1.252612 -0.376637
C  -1.951763 0.356082 0.329939
C  -1.076566 -1.63767 -0.733414
C  -2.187208 -0.837133 -0.384197
C  2.944031 -0.489529 0.382801
H  1.886066 0.577796 1.848224
H  2.059806 1.411159 0.292777
H  -0.503692 1.691437 1.250911
H  1.08605 -1.885132 -0.653916
H  -1.240183 -2.567836 -1.287519
H  -3.203004 -1.133869 -0.659187
